{
  "data_features": {
    "feature": [
      {
        "data_type": "numeric",
        "index": "0",
        "is_ignore": "false",
        "is_row_identifier": "false",
        "is_target": "false",
        "name": "Age",
        "number_of_missing_values": "1"
      },
      {
        "data_type": "nominal",
        "index": "1",
        "is_ignore": "false",
        "is_row_identifier": "false",
        "is_target": "false",
        "name": "Sex",
        "nominal_value": [
          "0",
          "1",
          "4"
        ],
        "number_of_missing_values": "1"
      },
      {
        "data_type": "numeric",
        "index": "2",
        "is_ignore": "false",
        "is_row_identifier": "false",
        "is_target": "false",
        "name": "Income",
        "number_of_missing_values": "44"
      },
      {
        "data_type": "numeric",
        "index": "3",
        "is_ignore": "false",
        "is_row_identifier": "false",
        "is_target": "false",
        "name": "Travel_cost",
        "number_of_missing_values": "3"
      },
      {
        "data_type": "nominal",
        "index": "4",
        "is_ignore": "false",
        "is_row_identifier": "false",
        "is_target": "false",
        "name": "Access_road",
        "nominal_value": [
          "0",
          "1"
        ],
        "number_of_missing_values": "0"
      },
      {
        "data_type": "nominal",
        "index": "5",
        "is_ignore": "false",
        "is_row_identifier": "false",
        "is_target": "false",
        "name": "Active",
        "nominal_value": [
          "0",
          "1",
          "2",
          "3",
          "4",
          "5",
          "6"
        ],
        "number_of_missing_values": "2"
      },
      {
        "data_type": "nominal",
        "index": "6",
        "is_ignore": "false",
        "is_row_identifier": "false",
        "is_target": "false",
        "name": "Passive",
        "nominal_value": [
          "0",
          "1",
          "2",
          "3",
          "4"
        ],
        "number_of_missing_values": "1"
      },
      {
        "data_type": "numeric",
        "index": "7",
        "is_ignore": "false",
        "is_row_identifier": "false",
        "is_target": "false",
        "name": "Logged_income",
        "number_of_missing_values": "44"
      },
      {
        "data_type": "nominal",
        "index": "8",
        "is_ignore": "false",
        "is_row_identifier": "false",
        "is_target": "true",
        "name": "Trips",
        "nominal_value": [
          "0",
          "1",
          "2",
          "3",
          "4",
          "5",
          "7"
        ],
        "number_of_missing_values": "0"
      }
    ]
  }
}