{
  "data_qualities": {
    "quality": [
      {
        "name": "AutoCorrelation",
        "value": "0.18743194898117904"
      },
      {
        "name": "CfsSubsetEval_DecisionStumpAUC",
        "value": "0.9273091445992578"
      },
      {
        "name": "CfsSubsetEval_DecisionStumpErrRate",
        "value": "0.14836702954898912"
      },
      {
        "name": "CfsSubsetEval_DecisionStumpKappa",
        "value": "0.8167814524247422"
      },
      {
        "name": "CfsSubsetEval_NaiveBayesAUC",
        "value": "0.9273091445992578"
      },
      {
        "name": "CfsSubsetEval_NaiveBayesErrRate",
        "value": "0.14836702954898912"
      },
      {
        "name": "CfsSubsetEval_NaiveBayesKappa",
        "value": "0.8167814524247422"
      },
      {
        "name": "CfsSubsetEval_kNN1NAUC",
        "value": "0.9273091445992578"
      },
      {
        "name": "CfsSubsetEval_kNN1NErrRate",
        "value": "0.14836702954898912"
      },
      {
        "name": "CfsSubsetEval_kNN1NKappa",
        "value": "0.8167814524247422"
      },
      {
        "name": "ClassEntropy",
        "value": "2.4833618760456604"
      },
      {
        "name": "DecisionStumpAUC",
        "value": "0.710936921295261"
      },
      {
        "name": "DecisionStumpErrRate",
        "value": "0.563452566096423"
      },
      {
        "name": "DecisionStumpKappa",
        "value": "0.26828644698090565"
      },
      {
        "name": "Dimensionality",
        "value": "0.0057542768273716955"
      },
      {
        "name": "EquivalentNumberOfAtts",
        "value": []
      },
      {
        "name": "J48.00001.AUC",
        "value": "0.9197259342536087"
      },
      {
        "name": "J48.00001.ErrRate",
        "value": "0.14152410575427682"
      },
      {
        "name": "J48.00001.Kappa",
        "value": "0.8249582236698434"
      },
      {
        "name": "J48.0001.AUC",
        "value": "0.9197259342536087"
      },
      {
        "name": "J48.0001.ErrRate",
        "value": "0.14152410575427682"
      },
      {
        "name": "J48.0001.Kappa",
        "value": "0.8249582236698434"
      },
      {
        "name": "J48.001.AUC",
        "value": "0.9197259342536087"
      },
      {
        "name": "J48.001.ErrRate",
        "value": "0.14152410575427682"
      },
      {
        "name": "J48.001.Kappa",
        "value": "0.8249582236698434"
      },
      {
        "name": "MajorityClassPercentage",
        "value": "23.81026438569207"
      },
      {
        "name": "MajorityClassSize",
        "value": "1531.0"
      },
      {
        "name": "MaxAttributeEntropy",
        "value": []
      },
      {
        "name": "MaxKurtosisOfNumericAtts",
        "value": "1.277985361665814"
      },
      {
        "name": "MaxMeansOfNumericAtts",
        "value": "-1.2632970451019481E-4"
      },
      {
        "name": "MaxMutualInformation",
        "value": []
      },
      {
        "name": "MaxNominalAttDistinctValues",
        "value": "6.0"
      },
      {
        "name": "MaxSkewnessOfNumericAtts",
        "value": "0.91949549901627"
      },
      {
        "name": "MaxStdDevOfNumericAtts",
        "value": "1.0002882819750798"
      },
      {
        "name": "MeanAttributeEntropy",
        "value": []
      },
      {
        "name": "MeanKurtosisOfNumericAtts",
        "value": "-0.15411688047872"
      },
      {
        "name": "MeanMeansOfNumericAtts",
        "value": "-5.560885260065659E-4"
      },
      {
        "name": "MeanMutualInformation",
        "value": []
      },
      {
        "name": "MeanNoiseToSignalRatio",
        "value": []
      },
      {
        "name": "MeanNominalAttDistinctValues",
        "value": "6.0"
      },
      {
        "name": "MeanSkewnessOfNumericAtts",
        "value": "0.04046023385100257"
      },
      {
        "name": "MeanStdDevOfNumericAtts",
        "value": "1.0000219953862926"
      },
      {
        "name": "MinAttributeEntropy",
        "value": []
      },
      {
        "name": "MinKurtosisOfNumericAtts",
        "value": "-0.9198282387807679"
      },
      {
        "name": "MinMeansOfNumericAtts",
        "value": "-8.62968584758966E-4"
      },
      {
        "name": "MinMutualInformation",
        "value": []
      },
      {
        "name": "MinNominalAttDistinctValues",
        "value": "6.0"
      },
      {
        "name": "MinSkewnessOfNumericAtts",
        "value": "-0.6740118722728707"
      },
      {
        "name": "MinStdDevOfNumericAtts",
        "value": "0.9996387437607501"
      },
      {
        "name": "MinorityClassPercentage",
        "value": "9.720062208398133"
      },
      {
        "name": "MinorityClassSize",
        "value": "625.0"
      },
      {
        "name": "NaiveBayesAUC",
        "value": "0.9605992160078025"
      },
      {
        "name": "NaiveBayesErrRate",
        "value": "0.20326594090202177"
      },
      {
        "name": "NaiveBayesKappa",
        "value": "0.7513714566665727"
      },
      {
        "name": "NumberOfBinaryFeatures",
        "value": "0.0"
      },
      {
        "name": "NumberOfClasses",
        "value": "6.0"
      },
      {
        "name": "NumberOfFeatures",
        "value": "37.0"
      },
      {
        "name": "NumberOfInstances",
        "value": "6430.0"
      },
      {
        "name": "NumberOfInstancesWithMissingValues",
        "value": "0.0"
      },
      {
        "name": "NumberOfMissingValues",
        "value": "0.0"
      },
      {
        "name": "NumberOfNumericFeatures",
        "value": "36.0"
      },
      {
        "name": "NumberOfSymbolicFeatures",
        "value": "1.0"
      },
      {
        "name": "PercentageOfBinaryFeatures",
        "value": "0.0"
      },
      {
        "name": "PercentageOfInstancesWithMissingValues",
        "value": "0.0"
      },
      {
        "name": "PercentageOfMissingValues",
        "value": "0.0"
      },
      {
        "name": "PercentageOfNumericFeatures",
        "value": "97.2972972972973"
      },
      {
        "name": "PercentageOfSymbolicFeatures",
        "value": "2.7027027027027026"
      },
      {
        "name": "Quartile1AttributeEntropy",
        "value": []
      },
      {
        "name": "Quartile1KurtosisOfNumericAtts",
        "value": "-0.8393811657498382"
      },
      {
        "name": "Quartile1MeansOfNumericAtts",
        "value": "-7.437709953344221E-4"
      },
      {
        "name": "Quartile1MutualInformation",
        "value": []
      },
      {
        "name": "Quartile1SkewnessOfNumericAtts",
        "value": "-0.5170961259457099"
      },
      {
        "name": "Quartile1StdDevOfNumericAtts",
        "value": "0.9999476046671038"
      },
      {
        "name": "Quartile2AttributeEntropy",
        "value": []
      },
      {
        "name": "Quartile2KurtosisOfNumericAtts",
        "value": "-0.4798469406404684"
      },
      {
        "name": "Quartile2MeansOfNumericAtts",
        "value": "-5.980934681181398E-4"
      },
      {
        "name": "Quartile2MutualInformation",
        "value": []
      },
      {
        "name": "Quartile2SkewnessOfNumericAtts",
        "value": "-0.0399749828019159"
      },
      {
        "name": "Quartile2StdDevOfNumericAtts",
        "value": "1.0000052923046026"
      },
      {
        "name": "Quartile3AttributeEntropy",
        "value": []
      },
      {
        "name": "Quartile3KurtosisOfNumericAtts",
        "value": "0.8509747335126359"
      },
      {
        "name": "Quartile3MeansOfNumericAtts",
        "value": "-3.569454121306532E-4"
      },
      {
        "name": "Quartile3MutualInformation",
        "value": []
      },
      {
        "name": "Quartile3SkewnessOfNumericAtts",
        "value": "0.6744458273485395"
      },
      {
        "name": "Quartile3StdDevOfNumericAtts",
        "value": "1.0001949690399905"
      },
      {
        "name": "REPTreeDepth1AUC",
        "value": "0.962333455035218"
      },
      {
        "name": "REPTreeDepth1ErrRate",
        "value": "0.15349922239502334"
      },
      {
        "name": "REPTreeDepth1Kappa",
        "value": "0.8100028845003834"
      },
      {
        "name": "REPTreeDepth2AUC",
        "value": "0.962333455035218"
      },
      {
        "name": "REPTreeDepth2ErrRate",
        "value": "0.15349922239502334"
      },
      {
        "name": "REPTreeDepth2Kappa",
        "value": "0.8100028845003834"
      },
      {
        "name": "REPTreeDepth3AUC",
        "value": "0.962333455035218"
      },
      {
        "name": "REPTreeDepth3ErrRate",
        "value": "0.15349922239502334"
      },
      {
        "name": "REPTreeDepth3Kappa",
        "value": "0.8100028845003834"
      },
      {
        "name": "RandomTreeDepth1AUC",
        "value": "0.8991170554983932"
      },
      {
        "name": "RandomTreeDepth1ErrRate",
        "value": "0.16625194401244167"
      },
      {
        "name": "RandomTreeDepth1Kappa",
        "value": "0.7945482122759002"
      },
      {
        "name": "RandomTreeDepth2AUC",
        "value": "0.8991170554983932"
      },
      {
        "name": "RandomTreeDepth2ErrRate",
        "value": "0.16625194401244167"
      },
      {
        "name": "RandomTreeDepth2Kappa",
        "value": "0.7945482122759002"
      },
      {
        "name": "RandomTreeDepth3AUC",
        "value": "0.8991170554983932"
      },
      {
        "name": "RandomTreeDepth3ErrRate",
        "value": "0.16625194401244167"
      },
      {
        "name": "RandomTreeDepth3Kappa",
        "value": "0.7945482122759002"
      },
      {
        "name": "StdvNominalAttDistinctValues",
        "value": "0.0"
      },
      {
        "name": "kNN1NAUC",
        "value": "0.9355091276480466"
      },
      {
        "name": "kNN1NErrRate",
        "value": "0.10762052877138413"
      },
      {
        "name": "kNN1NKappa",
        "value": "0.8673837948848537"
      }
    ]
  }
}