{
  "data_qualities": {
    "quality": [
      {
        "name": "AutoCorrelation",
        "value": "0.4811320754716981"
      },
      {
        "name": "CfsSubsetEval_DecisionStumpAUC",
        "value": "0.771297009731484"
      },
      {
        "name": "CfsSubsetEval_DecisionStumpErrRate",
        "value": "0.3904761904761905"
      },
      {
        "name": "CfsSubsetEval_DecisionStumpKappa",
        "value": "0.4187145557655956"
      },
      {
        "name": "CfsSubsetEval_NaiveBayesAUC",
        "value": "0.771297009731484"
      },
      {
        "name": "CfsSubsetEval_NaiveBayesErrRate",
        "value": "0.3904761904761905"
      },
      {
        "name": "CfsSubsetEval_NaiveBayesKappa",
        "value": "0.4187145557655956"
      },
      {
        "name": "CfsSubsetEval_kNN1NAUC",
        "value": "0.771297009731484"
      },
      {
        "name": "CfsSubsetEval_kNN1NErrRate",
        "value": "0.3904761904761905"
      },
      {
        "name": "CfsSubsetEval_kNN1NKappa",
        "value": "0.4187145557655956"
      },
      {
        "name": "ClassEntropy",
        "value": "2.3236526486373053"
      },
      {
        "name": "DecisionStumpAUC",
        "value": "0.6675446142057514"
      },
      {
        "name": "DecisionStumpErrRate",
        "value": "0.42857142857142855"
      },
      {
        "name": "DecisionStumpKappa",
        "value": "0.3105209397344228"
      },
      {
        "name": "Dimensionality",
        "value": "0.11214953271028037"
      },
      {
        "name": "EquivalentNumberOfAtts",
        "value": "4.615526678659706"
      },
      {
        "name": "J48.00001.AUC",
        "value": "0.8125317351721952"
      },
      {
        "name": "J48.00001.ErrRate",
        "value": "0.3619047619047619"
      },
      {
        "name": "J48.00001.Kappa",
        "value": "0.5188133140376265"
      },
      {
        "name": "J48.0001.AUC",
        "value": "0.8125317351721952"
      },
      {
        "name": "J48.0001.ErrRate",
        "value": "0.3619047619047619"
      },
      {
        "name": "J48.0001.Kappa",
        "value": "0.5188133140376265"
      },
      {
        "name": "J48.001.AUC",
        "value": "0.8125317351721952"
      },
      {
        "name": "J48.001.ErrRate",
        "value": "0.3619047619047619"
      },
      {
        "name": "J48.001.Kappa",
        "value": "0.5188133140376265"
      },
      {
        "name": "MajorityClassPercentage",
        "value": "41.1214953271028"
      },
      {
        "name": "MajorityClassSize",
        "value": "44.0"
      },
      {
        "name": "MaxAttributeEntropy",
        "value": "5.574234715470477"
      },
      {
        "name": "MaxKurtosisOfNumericAtts",
        "value": "3.577028496590202"
      },
      {
        "name": "MaxMeansOfNumericAtts",
        "value": "1905.233644859813"
      },
      {
        "name": "MaxMutualInformation",
        "value": "1.54436220017699"
      },
      {
        "name": "MaxNominalAttDistinctValues",
        "value": "54.0"
      },
      {
        "name": "MaxSkewnessOfNumericAtts",
        "value": "1.7361494689591883"
      },
      {
        "name": "MaxStdDevOfNumericAtts",
        "value": "747.4915231362116"
      },
      {
        "name": "MeanAttributeEntropy",
        "value": "1.7176584504363521"
      },
      {
        "name": "MeanKurtosisOfNumericAtts",
        "value": "1.3867187280827946"
      },
      {
        "name": "MeanMeansOfNumericAtts",
        "value": "1158.444405148297"
      },
      {
        "name": "MeanMutualInformation",
        "value": "0.5034425777194438"
      },
      {
        "name": "MeanNoiseToSignalRatio",
        "value": "2.411825948884206"
      },
      {
        "name": "MeanNominalAttDistinctValues",
        "value": "9.0"
      },
      {
        "name": "MeanSkewnessOfNumericAtts",
        "value": "0.9672319041999522"
      },
      {
        "name": "MeanStdDevOfNumericAtts",
        "value": "261.9983875726186"
      },
      {
        "name": "MinAttributeEntropy",
        "value": "0.5847281182574744"
      },
      {
        "name": "MinKurtosisOfNumericAtts",
        "value": "-0.36316477697827887"
      },
      {
        "name": "MinMeansOfNumericAtts",
        "value": "2.6304347826086962"
      },
      {
        "name": "MinMutualInformation",
        "value": "0.14862885098635"
      },
      {
        "name": "MinNominalAttDistinctValues",
        "value": "2.0"
      },
      {
        "name": "MinSkewnessOfNumericAtts",
        "value": "-0.11078293497155618"
      },
      {
        "name": "MinStdDevOfNumericAtts",
        "value": "1.1646571094159597"
      },
      {
        "name": "MinorityClassPercentage",
        "value": "1.8691588785046727"
      },
      {
        "name": "MinorityClassSize",
        "value": "2.0"
      },
      {
        "name": "NaiveBayesAUC",
        "value": "0.8405539028218266"
      },
      {
        "name": "NaiveBayesErrRate",
        "value": "0.37142857142857144"
      },
      {
        "name": "NaiveBayesKappa",
        "value": "0.5027322404371585"
      },
      {
        "name": "NumberOfBinaryFeatures",
        "value": "2.0"
      },
      {
        "name": "NumberOfClasses",
        "value": "7.0"
      },
      {
        "name": "NumberOfFeatures",
        "value": "12.0"
      },
      {
        "name": "NumberOfInstances",
        "value": "107.0"
      },
      {
        "name": "NumberOfInstancesWithMissingValues",
        "value": "37.0"
      },
      {
        "name": "NumberOfMissingValues",
        "value": "73.0"
      },
      {
        "name": "NumberOfNumericFeatures",
        "value": "3.0"
      },
      {
        "name": "NumberOfSymbolicFeatures",
        "value": "9.0"
      },
      {
        "name": "PercentageOfBinaryFeatures",
        "value": "16.666666666666664"
      },
      {
        "name": "PercentageOfInstancesWithMissingValues",
        "value": "34.57943925233645"
      },
      {
        "name": "PercentageOfMissingValues",
        "value": "5.685358255451713"
      },
      {
        "name": "PercentageOfNumericFeatures",
        "value": "25.0"
      },
      {
        "name": "PercentageOfSymbolicFeatures",
        "value": "75.0"
      },
      {
        "name": "Quartile1AttributeEntropy",
        "value": "0.8975706740809617"
      },
      {
        "name": "Quartile1KurtosisOfNumericAtts",
        "value": "-0.36316477697827887"
      },
      {
        "name": "Quartile1MeansOfNumericAtts",
        "value": "2.6304347826086962"
      },
      {
        "name": "Quartile1MutualInformation",
        "value": "0.24825024735315748"
      },
      {
        "name": "Quartile1SkewnessOfNumericAtts",
        "value": "-0.11078293497155618"
      },
      {
        "name": "Quartile1StdDevOfNumericAtts",
        "value": "1.1646571094159597"
      },
      {
        "name": "Quartile2AttributeEntropy",
        "value": "1.279714059104804"
      },
      {
        "name": "Quartile2KurtosisOfNumericAtts",
        "value": "0.9462924646364601"
      },
      {
        "name": "Quartile2MeansOfNumericAtts",
        "value": "1567.469135802469"
      },
      {
        "name": "Quartile2MutualInformation",
        "value": "0.354259535788115"
      },
      {
        "name": "Quartile2SkewnessOfNumericAtts",
        "value": "1.2763291786122244"
      },
      {
        "name": "Quartile2StdDevOfNumericAtts",
        "value": "37.3389824722282"
      },
      {
        "name": "Quartile3AttributeEntropy",
        "value": "1.5683038136017138"
      },
      {
        "name": "Quartile3KurtosisOfNumericAtts",
        "value": "3.577028496590202"
      },
      {
        "name": "Quartile3MeansOfNumericAtts",
        "value": "1905.233644859813"
      },
      {
        "name": "Quartile3MutualInformation",
        "value": "0.6422947112913375"
      },
      {
        "name": "Quartile3SkewnessOfNumericAtts",
        "value": "1.7361494689591883"
      },
      {
        "name": "Quartile3StdDevOfNumericAtts",
        "value": "747.4915231362116"
      },
      {
        "name": "REPTreeDepth1AUC",
        "value": "0.48998453256093166"
      },
      {
        "name": "REPTreeDepth1ErrRate",
        "value": "0.580952380952381"
      },
      {
        "name": "REPTreeDepth1Kappa",
        "value": "0.0"
      },
      {
        "name": "REPTreeDepth2AUC",
        "value": "0.48998453256093166"
      },
      {
        "name": "REPTreeDepth2ErrRate",
        "value": "0.580952380952381"
      },
      {
        "name": "REPTreeDepth2Kappa",
        "value": "0.0"
      },
      {
        "name": "REPTreeDepth3AUC",
        "value": "0.48998453256093166"
      },
      {
        "name": "REPTreeDepth3ErrRate",
        "value": "0.580952380952381"
      },
      {
        "name": "REPTreeDepth3Kappa",
        "value": "0.0"
      },
      {
        "name": "RandomTreeDepth1AUC",
        "value": "0.6207320767098522"
      },
      {
        "name": "RandomTreeDepth1ErrRate",
        "value": "0.580952380952381"
      },
      {
        "name": "RandomTreeDepth1Kappa",
        "value": "0.20276325616131444"
      },
      {
        "name": "RandomTreeDepth2AUC",
        "value": "0.6207320767098522"
      },
      {
        "name": "RandomTreeDepth2ErrRate",
        "value": "0.580952380952381"
      },
      {
        "name": "RandomTreeDepth2Kappa",
        "value": "0.20276325616131444"
      },
      {
        "name": "RandomTreeDepth3AUC",
        "value": "0.6207320767098522"
      },
      {
        "name": "RandomTreeDepth3ErrRate",
        "value": "0.580952380952381"
      },
      {
        "name": "RandomTreeDepth3Kappa",
        "value": "0.20276325616131444"
      },
      {
        "name": "StdvNominalAttDistinctValues",
        "value": "16.91892431568863"
      },
      {
        "name": "kNN1NAUC",
        "value": "0.7131538652425516"
      },
      {
        "name": "kNN1NErrRate",
        "value": "0.42857142857142855"
      },
      {
        "name": "kNN1NKappa",
        "value": "0.43649373881932013"
      }
    ]
  }
}