{
  "data_qualities": {
    "quality": [
      {
        "name": "AutoCorrelation",
        "value": "0.9904761904761905"
      },
      {
        "name": "CfsSubsetEval_DecisionStumpAUC",
        "value": "0.834816660733357"
      },
      {
        "name": "CfsSubsetEval_DecisionStumpErrRate",
        "value": "0.2169811320754717"
      },
      {
        "name": "CfsSubsetEval_DecisionStumpKappa",
        "value": "0.5660377358490567"
      },
      {
        "name": "CfsSubsetEval_NaiveBayesAUC",
        "value": "0.834816660733357"
      },
      {
        "name": "CfsSubsetEval_NaiveBayesErrRate",
        "value": "0.2169811320754717"
      },
      {
        "name": "CfsSubsetEval_NaiveBayesKappa",
        "value": "0.5660377358490567"
      },
      {
        "name": "CfsSubsetEval_kNN1NAUC",
        "value": "0.834816660733357"
      },
      {
        "name": "CfsSubsetEval_kNN1NErrRate",
        "value": "0.2169811320754717"
      },
      {
        "name": "CfsSubsetEval_kNN1NKappa",
        "value": "0.5660377358490567"
      },
      {
        "name": "ClassEntropy",
        "value": "1.0"
      },
      {
        "name": "DecisionStumpAUC",
        "value": "0.7429690281238875"
      },
      {
        "name": "DecisionStumpErrRate",
        "value": "0.24528301886792453"
      },
      {
        "name": "DecisionStumpKappa",
        "value": "0.509433962264151"
      },
      {
        "name": "Dimensionality",
        "value": "0.5471698113207547"
      },
      {
        "name": "EquivalentNumberOfAtts",
        "value": "16.250002080437646"
      },
      {
        "name": "J48.00001.AUC",
        "value": "0.8469206123175508"
      },
      {
        "name": "J48.00001.ErrRate",
        "value": "0.2169811320754717"
      },
      {
        "name": "J48.00001.Kappa",
        "value": "0.5660377358490567"
      },
      {
        "name": "J48.0001.AUC",
        "value": "0.8469206123175508"
      },
      {
        "name": "J48.0001.ErrRate",
        "value": "0.2169811320754717"
      },
      {
        "name": "J48.0001.Kappa",
        "value": "0.5660377358490567"
      },
      {
        "name": "J48.001.AUC",
        "value": "0.8469206123175508"
      },
      {
        "name": "J48.001.ErrRate",
        "value": "0.2169811320754717"
      },
      {
        "name": "J48.001.Kappa",
        "value": "0.5660377358490567"
      },
      {
        "name": "MajorityClassPercentage",
        "value": "50.0"
      },
      {
        "name": "MajorityClassSize",
        "value": "53.0"
      },
      {
        "name": "MaxAttributeEntropy",
        "value": "1.9992195826800947"
      },
      {
        "name": "MaxKurtosisOfNumericAtts",
        "value": []
      },
      {
        "name": "MaxMeansOfNumericAtts",
        "value": []
      },
      {
        "name": "MaxMutualInformation",
        "value": "0.3472982896004"
      },
      {
        "name": "MaxNominalAttDistinctValues",
        "value": "4.0"
      },
      {
        "name": "MaxSkewnessOfNumericAtts",
        "value": []
      },
      {
        "name": "MaxStdDevOfNumericAtts",
        "value": []
      },
      {
        "name": "MeanAttributeEntropy",
        "value": "1.9463318262882665"
      },
      {
        "name": "MeanKurtosisOfNumericAtts",
        "value": []
      },
      {
        "name": "MeanMeansOfNumericAtts",
        "value": []
      },
      {
        "name": "MeanMutualInformation",
        "value": "0.06153845365988211"
      },
      {
        "name": "MeanNoiseToSignalRatio",
        "value": "30.627896226406335"
      },
      {
        "name": "MeanNominalAttDistinctValues",
        "value": "3.9655172413793105"
      },
      {
        "name": "MeanSkewnessOfNumericAtts",
        "value": []
      },
      {
        "name": "MeanStdDevOfNumericAtts",
        "value": []
      },
      {
        "name": "MinAttributeEntropy",
        "value": "1.7435464805971514"
      },
      {
        "name": "MinKurtosisOfNumericAtts",
        "value": []
      },
      {
        "name": "MinMeansOfNumericAtts",
        "value": []
      },
      {
        "name": "MinMutualInformation",
        "value": "0.00195601213531"
      },
      {
        "name": "MinNominalAttDistinctValues",
        "value": "2.0"
      },
      {
        "name": "MinSkewnessOfNumericAtts",
        "value": []
      },
      {
        "name": "MinStdDevOfNumericAtts",
        "value": []
      },
      {
        "name": "MinorityClassPercentage",
        "value": "50.0"
      },
      {
        "name": "MinorityClassSize",
        "value": "53.0"
      },
      {
        "name": "NaiveBayesAUC",
        "value": "0.9551441794232823"
      },
      {
        "name": "NaiveBayesErrRate",
        "value": "0.09433962264150944"
      },
      {
        "name": "NaiveBayesKappa",
        "value": "0.8113207547169812"
      },
      {
        "name": "NumberOfBinaryFeatures",
        "value": "1.0"
      },
      {
        "name": "NumberOfClasses",
        "value": "2.0"
      },
      {
        "name": "NumberOfFeatures",
        "value": "58.0"
      },
      {
        "name": "NumberOfInstances",
        "value": "106.0"
      },
      {
        "name": "NumberOfInstancesWithMissingValues",
        "value": "0.0"
      },
      {
        "name": "NumberOfMissingValues",
        "value": "0.0"
      },
      {
        "name": "NumberOfNumericFeatures",
        "value": "0.0"
      },
      {
        "name": "NumberOfSymbolicFeatures",
        "value": "58.0"
      },
      {
        "name": "PercentageOfBinaryFeatures",
        "value": "1.7241379310344827"
      },
      {
        "name": "PercentageOfInstancesWithMissingValues",
        "value": "0.0"
      },
      {
        "name": "PercentageOfMissingValues",
        "value": "0.0"
      },
      {
        "name": "PercentageOfNumericFeatures",
        "value": "0.0"
      },
      {
        "name": "PercentageOfSymbolicFeatures",
        "value": "100.0"
      },
      {
        "name": "Quartile1AttributeEntropy",
        "value": "1.930552190083697"
      },
      {
        "name": "Quartile1KurtosisOfNumericAtts",
        "value": []
      },
      {
        "name": "Quartile1MeansOfNumericAtts",
        "value": []
      },
      {
        "name": "Quartile1MutualInformation",
        "value": "0.018497136678365"
      },
      {
        "name": "Quartile1SkewnessOfNumericAtts",
        "value": []
      },
      {
        "name": "Quartile1StdDevOfNumericAtts",
        "value": []
      },
      {
        "name": "Quartile2AttributeEntropy",
        "value": "1.9610985271643535"
      },
      {
        "name": "Quartile2KurtosisOfNumericAtts",
        "value": []
      },
      {
        "name": "Quartile2MeansOfNumericAtts",
        "value": []
      },
      {
        "name": "Quartile2MutualInformation",
        "value": "0.03368071987132"
      },
      {
        "name": "Quartile2SkewnessOfNumericAtts",
        "value": []
      },
      {
        "name": "Quartile2StdDevOfNumericAtts",
        "value": []
      },
      {
        "name": "Quartile3AttributeEntropy",
        "value": "1.9829035198530844"
      },
      {
        "name": "Quartile3KurtosisOfNumericAtts",
        "value": []
      },
      {
        "name": "Quartile3MeansOfNumericAtts",
        "value": []
      },
      {
        "name": "Quartile3MutualInformation",
        "value": "0.073346173041995"
      },
      {
        "name": "Quartile3SkewnessOfNumericAtts",
        "value": []
      },
      {
        "name": "Quartile3StdDevOfNumericAtts",
        "value": []
      },
      {
        "name": "REPTreeDepth1AUC",
        "value": "0.7050551797792808"
      },
      {
        "name": "REPTreeDepth1ErrRate",
        "value": "0.29245283018867924"
      },
      {
        "name": "REPTreeDepth1Kappa",
        "value": "0.4150943396226414"
      },
      {
        "name": "REPTreeDepth2AUC",
        "value": "0.7050551797792808"
      },
      {
        "name": "REPTreeDepth2ErrRate",
        "value": "0.29245283018867924"
      },
      {
        "name": "REPTreeDepth2Kappa",
        "value": "0.4150943396226414"
      },
      {
        "name": "REPTreeDepth3AUC",
        "value": "0.7050551797792808"
      },
      {
        "name": "REPTreeDepth3ErrRate",
        "value": "0.29245283018867924"
      },
      {
        "name": "REPTreeDepth3Kappa",
        "value": "0.4150943396226414"
      },
      {
        "name": "RandomTreeDepth1AUC",
        "value": "0.6383054467782129"
      },
      {
        "name": "RandomTreeDepth1ErrRate",
        "value": "0.36792452830188677"
      },
      {
        "name": "RandomTreeDepth1Kappa",
        "value": "0.26415094339622636"
      },
      {
        "name": "RandomTreeDepth2AUC",
        "value": "0.6383054467782129"
      },
      {
        "name": "RandomTreeDepth2ErrRate",
        "value": "0.36792452830188677"
      },
      {
        "name": "RandomTreeDepth2Kappa",
        "value": "0.26415094339622636"
      },
      {
        "name": "RandomTreeDepth3AUC",
        "value": "0.6383054467782129"
      },
      {
        "name": "RandomTreeDepth3ErrRate",
        "value": "0.36792452830188677"
      },
      {
        "name": "RandomTreeDepth3Kappa",
        "value": "0.26415094339622636"
      },
      {
        "name": "StdvNominalAttDistinctValues",
        "value": "0.2626128657194452"
      },
      {
        "name": "kNN1NAUC",
        "value": "0.8912424350302599"
      },
      {
        "name": "kNN1NErrRate",
        "value": "0.16037735849056603"
      },
      {
        "name": "kNN1NKappa",
        "value": "0.679245283018868"
      }
    ]
  }
}