{
  "data_set_description": {
    "contributor": [
      "libSVM",
      "AAD group"
    ],
    "creator": "Laboratory of Artificial Intelligence and Computer Science of the University of Porto (LIACC)",
    "default_target_attribute": "class",
    "description": "**Author**: Laboratory of Artificial Intelligence and Computer Science of the University of Porto (LIACC)  \nlibSVM\",\"AAD group  \n**Source**: [original](http://www.csie.ntu.edu.tw/~cjlin/libsvmtools/datasets/binary.html) - Date unknown  \n**Please cite**:   \n\n#Dataset from the LIBSVM data repository.\n\nPreprocessing: scaled to [-1,1]",
    "description_version": "1",
    "file_id": "1594038",
    "format": "Sparse_ARFF",
    "id": "1574",
    "licence": "Public",
    "md5_checksum": "f50ad5f44a5aa587e7f3794007182eb2",
    "name": "heart",
    "original_data_url": "http://www.csie.ntu.edu.tw/~cjlin/libsvmtools/datasets/binary.html",
    "processing_date": "2018-10-03 21:40:10",
    "status": "active",
    "upload_date": "2015-06-02T11:29:13",
    "url": "https://api.openml.org/data/v1/download/1594038/heart.sparse_arff",
    "version": "1",
    "visibility": "public"
  }
}