{
  "data_qualities": {
    "quality": [
      {
        "name": "AutoCorrelation",
        "value": "0.9561128526645768"
      },
      {
        "name": "CfsSubsetEval_DecisionStumpAUC",
        "value": "0.4972513048596772"
      },
      {
        "name": "CfsSubsetEval_DecisionStumpErrRate",
        "value": "0.08379013312451057"
      },
      {
        "name": "CfsSubsetEval_DecisionStumpKappa",
        "value": "0.0"
      },
      {
        "name": "CfsSubsetEval_NaiveBayesAUC",
        "value": "0.4972513048596772"
      },
      {
        "name": "CfsSubsetEval_NaiveBayesErrRate",
        "value": "0.08379013312451057"
      },
      {
        "name": "CfsSubsetEval_NaiveBayesKappa",
        "value": "0.0"
      },
      {
        "name": "CfsSubsetEval_kNN1NAUC",
        "value": "0.4972513048596772"
      },
      {
        "name": "CfsSubsetEval_kNN1NErrRate",
        "value": "0.08379013312451057"
      },
      {
        "name": "CfsSubsetEval_kNN1NKappa",
        "value": "0.0"
      },
      {
        "name": "ClassEntropy",
        "value": "0.5617930305866006"
      },
      {
        "name": "DecisionStumpAUC",
        "value": "0.766263007400969"
      },
      {
        "name": "DecisionStumpErrRate",
        "value": "0.08379013312451057"
      },
      {
        "name": "DecisionStumpKappa",
        "value": "0.0"
      },
      {
        "name": "Dimensionality",
        "value": "0.0031323414252153485"
      },
      {
        "name": "EquivalentNumberOfAtts",
        "value": []
      },
      {
        "name": "J48.00001.AUC",
        "value": "0.7086514406763342"
      },
      {
        "name": "J48.00001.ErrRate",
        "value": "0.09005481597494126"
      },
      {
        "name": "J48.00001.Kappa",
        "value": "0.17869546494264768"
      },
      {
        "name": "J48.0001.AUC",
        "value": "0.7086514406763342"
      },
      {
        "name": "J48.0001.ErrRate",
        "value": "0.09005481597494126"
      },
      {
        "name": "J48.0001.Kappa",
        "value": "0.17869546494264768"
      },
      {
        "name": "J48.001.AUC",
        "value": "0.7086514406763342"
      },
      {
        "name": "J48.001.ErrRate",
        "value": "0.09005481597494126"
      },
      {
        "name": "J48.001.Kappa",
        "value": "0.17869546494264768"
      },
      {
        "name": "MajorityClassPercentage",
        "value": "91.62098668754895"
      },
      {
        "name": "MajorityClassSize",
        "value": "1170.0"
      },
      {
        "name": "MaxAttributeEntropy",
        "value": []
      },
      {
        "name": "MaxKurtosisOfNumericAtts",
        "value": "1.6910806409138317"
      },
      {
        "name": "MaxMeansOfNumericAtts",
        "value": "538.0696945967114"
      },
      {
        "name": "MaxMutualInformation",
        "value": []
      },
      {
        "name": "MaxNominalAttDistinctValues",
        "value": "5.0"
      },
      {
        "name": "MaxSkewnessOfNumericAtts",
        "value": "1.3560223311272366"
      },
      {
        "name": "MaxStdDevOfNumericAtts",
        "value": "285.5208344707573"
      },
      {
        "name": "MeanAttributeEntropy",
        "value": []
      },
      {
        "name": "MeanKurtosisOfNumericAtts",
        "value": "-0.22252644347026695"
      },
      {
        "name": "MeanMeansOfNumericAtts",
        "value": "341.88903815661746"
      },
      {
        "name": "MeanMutualInformation",
        "value": []
      },
      {
        "name": "MeanNoiseToSignalRatio",
        "value": []
      },
      {
        "name": "MeanNominalAttDistinctValues",
        "value": "5.0"
      },
      {
        "name": "MeanSkewnessOfNumericAtts",
        "value": "0.43179155415207293"
      },
      {
        "name": "MeanStdDevOfNumericAtts",
        "value": "189.06168296132975"
      },
      {
        "name": "MinAttributeEntropy",
        "value": []
      },
      {
        "name": "MinKurtosisOfNumericAtts",
        "value": "-1.2317283070145513"
      },
      {
        "name": "MinMeansOfNumericAtts",
        "value": "0.4329719483163665"
      },
      {
        "name": "MinMutualInformation",
        "value": []
      },
      {
        "name": "MinNominalAttDistinctValues",
        "value": "5.0"
      },
      {
        "name": "MinSkewnessOfNumericAtts",
        "value": "-0.12473049103751407"
      },
      {
        "name": "MinStdDevOfNumericAtts",
        "value": "0.07701349328856792"
      },
      {
        "name": "MinorityClassPercentage",
        "value": "0.7047768206734534"
      },
      {
        "name": "MinorityClassSize",
        "value": "9.0"
      },
      {
        "name": "NaiveBayesAUC",
        "value": "0.8631924099384248"
      },
      {
        "name": "NaiveBayesErrRate",
        "value": "0.09788566953797964"
      },
      {
        "name": "NaiveBayesKappa",
        "value": "0.18953979569040846"
      },
      {
        "name": "NumberOfBinaryFeatures",
        "value": "0.0"
      },
      {
        "name": "NumberOfClasses",
        "value": "5.0"
      },
      {
        "name": "NumberOfFeatures",
        "value": "4.0"
      },
      {
        "name": "NumberOfInstances",
        "value": "1277.0"
      },
      {
        "name": "NumberOfInstancesWithMissingValues",
        "value": "0.0"
      },
      {
        "name": "NumberOfMissingValues",
        "value": "0.0"
      },
      {
        "name": "NumberOfNumericFeatures",
        "value": "3.0"
      },
      {
        "name": "NumberOfSymbolicFeatures",
        "value": "1.0"
      },
      {
        "name": "PercentageOfBinaryFeatures",
        "value": "0.0"
      },
      {
        "name": "PercentageOfInstancesWithMissingValues",
        "value": "0.0"
      },
      {
        "name": "PercentageOfMissingValues",
        "value": "0.0"
      },
      {
        "name": "PercentageOfNumericFeatures",
        "value": "75.0"
      },
      {
        "name": "PercentageOfSymbolicFeatures",
        "value": "25.0"
      },
      {
        "name": "Quartile1AttributeEntropy",
        "value": []
      },
      {
        "name": "Quartile1KurtosisOfNumericAtts",
        "value": "-1.2317283070145513"
      },
      {
        "name": "Quartile1MeansOfNumericAtts",
        "value": "0.4329719483163665"
      },
      {
        "name": "Quartile1MutualInformation",
        "value": []
      },
      {
        "name": "Quartile1SkewnessOfNumericAtts",
        "value": "-0.12473049103751407"
      },
      {
        "name": "Quartile1StdDevOfNumericAtts",
        "value": "0.07701349328856792"
      },
      {
        "name": "Quartile2AttributeEntropy",
        "value": []
      },
      {
        "name": "Quartile2KurtosisOfNumericAtts",
        "value": "-1.1269316643100813"
      },
      {
        "name": "Quartile2MeansOfNumericAtts",
        "value": "487.1644479248246"
      },
      {
        "name": "Quartile2MutualInformation",
        "value": []
      },
      {
        "name": "Quartile2SkewnessOfNumericAtts",
        "value": "0.06408282236649626"
      },
      {
        "name": "Quartile2StdDevOfNumericAtts",
        "value": "281.58720091994337"
      },
      {
        "name": "Quartile3AttributeEntropy",
        "value": []
      },
      {
        "name": "Quartile3KurtosisOfNumericAtts",
        "value": "1.6910806409138317"
      },
      {
        "name": "Quartile3MeansOfNumericAtts",
        "value": "538.0696945967114"
      },
      {
        "name": "Quartile3MutualInformation",
        "value": []
      },
      {
        "name": "Quartile3SkewnessOfNumericAtts",
        "value": "1.3560223311272366"
      },
      {
        "name": "Quartile3StdDevOfNumericAtts",
        "value": "285.5208344707573"
      },
      {
        "name": "REPTreeDepth1AUC",
        "value": "0.7076719443971727"
      },
      {
        "name": "REPTreeDepth1ErrRate",
        "value": "0.08457321848081441"
      },
      {
        "name": "REPTreeDepth1Kappa",
        "value": "-9.289633349784754E-4"
      },
      {
        "name": "REPTreeDepth2AUC",
        "value": "0.7076719443971727"
      },
      {
        "name": "REPTreeDepth2ErrRate",
        "value": "0.08457321848081441"
      },
      {
        "name": "REPTreeDepth2Kappa",
        "value": "-9.289633349784754E-4"
      },
      {
        "name": "REPTreeDepth3AUC",
        "value": "0.7076719443971727"
      },
      {
        "name": "REPTreeDepth3ErrRate",
        "value": "0.08457321848081441"
      },
      {
        "name": "REPTreeDepth3Kappa",
        "value": "-9.289633349784754E-4"
      },
      {
        "name": "RandomTreeDepth1AUC",
        "value": "0.6170784965816739"
      },
      {
        "name": "RandomTreeDepth1ErrRate",
        "value": "0.13860610806577917"
      },
      {
        "name": "RandomTreeDepth1Kappa",
        "value": "0.1651128430539651"
      },
      {
        "name": "RandomTreeDepth2AUC",
        "value": "0.6170784965816739"
      },
      {
        "name": "RandomTreeDepth2ErrRate",
        "value": "0.13860610806577917"
      },
      {
        "name": "RandomTreeDepth2Kappa",
        "value": "0.1651128430539651"
      },
      {
        "name": "RandomTreeDepth3AUC",
        "value": "0.6170784965816739"
      },
      {
        "name": "RandomTreeDepth3ErrRate",
        "value": "0.13860610806577917"
      },
      {
        "name": "RandomTreeDepth3Kappa",
        "value": "0.1651128430539651"
      },
      {
        "name": "StdvNominalAttDistinctValues",
        "value": "0.0"
      },
      {
        "name": "kNN1NAUC",
        "value": "0.6155216324676334"
      },
      {
        "name": "kNN1NErrRate",
        "value": "0.1331245105716523"
      },
      {
        "name": "kNN1NKappa",
        "value": "0.17317631465689637"
      }
    ]
  }
}