{
  "data_qualities": {
    "quality": [
      {
        "name": "AutoCorrelation",
        "value": "0.9275893675527039"
      },
      {
        "name": "CfsSubsetEval_DecisionStumpAUC",
        "value": "1.0"
      },
      {
        "name": "CfsSubsetEval_DecisionStumpErrRate",
        "value": "0.0"
      },
      {
        "name": "CfsSubsetEval_DecisionStumpKappa",
        "value": "1.0"
      },
      {
        "name": "CfsSubsetEval_NaiveBayesAUC",
        "value": "1.0"
      },
      {
        "name": "CfsSubsetEval_NaiveBayesErrRate",
        "value": "0.0"
      },
      {
        "name": "CfsSubsetEval_NaiveBayesKappa",
        "value": "1.0"
      },
      {
        "name": "CfsSubsetEval_kNN1NAUC",
        "value": "1.0"
      },
      {
        "name": "CfsSubsetEval_kNN1NErrRate",
        "value": "0.0"
      },
      {
        "name": "CfsSubsetEval_kNN1NKappa",
        "value": "1.0"
      },
      {
        "name": "ClassEntropy",
        "value": "1.714632742265977"
      },
      {
        "name": "DecisionStumpAUC",
        "value": "0.869064833124999"
      },
      {
        "name": "DecisionStumpErrRate",
        "value": "0.21151026392961877"
      },
      {
        "name": "DecisionStumpKappa",
        "value": "0.6495074686321457"
      },
      {
        "name": "Dimensionality",
        "value": "5.498533724340176E-4"
      },
      {
        "name": "EquivalentNumberOfAtts",
        "value": []
      },
      {
        "name": "J48.00001.AUC",
        "value": "1.0"
      },
      {
        "name": "J48.00001.ErrRate",
        "value": "0.0"
      },
      {
        "name": "J48.00001.Kappa",
        "value": "1.0"
      },
      {
        "name": "J48.0001.AUC",
        "value": "1.0"
      },
      {
        "name": "J48.0001.ErrRate",
        "value": "0.0"
      },
      {
        "name": "J48.0001.Kappa",
        "value": "1.0"
      },
      {
        "name": "J48.001.AUC",
        "value": "1.0"
      },
      {
        "name": "J48.001.ErrRate",
        "value": "0.0"
      },
      {
        "name": "J48.001.Kappa",
        "value": "1.0"
      },
      {
        "name": "MajorityClassPercentage",
        "value": "40.41422287390029"
      },
      {
        "name": "MajorityClassSize",
        "value": "2205.0"
      },
      {
        "name": "MaxAttributeEntropy",
        "value": []
      },
      {
        "name": "MaxKurtosisOfNumericAtts",
        "value": "38.068859647164224"
      },
      {
        "name": "MaxMeansOfNumericAtts",
        "value": "1.290306818181818"
      },
      {
        "name": "MaxMutualInformation",
        "value": []
      },
      {
        "name": "MaxNominalAttDistinctValues",
        "value": "4.0"
      },
      {
        "name": "MaxSkewnessOfNumericAtts",
        "value": "5.014749913024599"
      },
      {
        "name": "MaxStdDevOfNumericAtts",
        "value": "0.6266995640726634"
      },
      {
        "name": "MeanAttributeEntropy",
        "value": []
      },
      {
        "name": "MeanKurtosisOfNumericAtts",
        "value": "20.919999260039127"
      },
      {
        "name": "MeanMeansOfNumericAtts",
        "value": "0.9857880315249266"
      },
      {
        "name": "MeanMutualInformation",
        "value": []
      },
      {
        "name": "MeanNoiseToSignalRatio",
        "value": []
      },
      {
        "name": "MeanNominalAttDistinctValues",
        "value": "4.0"
      },
      {
        "name": "MeanSkewnessOfNumericAtts",
        "value": "3.381802802687332"
      },
      {
        "name": "MeanStdDevOfNumericAtts",
        "value": "0.4846468978934752"
      },
      {
        "name": "MinAttributeEntropy",
        "value": []
      },
      {
        "name": "MinKurtosisOfNumericAtts",
        "value": "3.7711388729140243"
      },
      {
        "name": "MinMeansOfNumericAtts",
        "value": "0.6812692448680352"
      },
      {
        "name": "MinMutualInformation",
        "value": []
      },
      {
        "name": "MinNominalAttDistinctValues",
        "value": "4.0"
      },
      {
        "name": "MinSkewnessOfNumericAtts",
        "value": "1.7488556923500649"
      },
      {
        "name": "MinStdDevOfNumericAtts",
        "value": "0.34259423171428705"
      },
      {
        "name": "MinorityClassPercentage",
        "value": "6.011730205278592"
      },
      {
        "name": "MinorityClassSize",
        "value": "328.0"
      },
      {
        "name": "NaiveBayesAUC",
        "value": "0.9844939066640793"
      },
      {
        "name": "NaiveBayesErrRate",
        "value": "0.093841642228739"
      },
      {
        "name": "NaiveBayesKappa",
        "value": "0.8594661572148512"
      },
      {
        "name": "NumberOfBinaryFeatures",
        "value": "0.0"
      },
      {
        "name": "NumberOfClasses",
        "value": "4.0"
      },
      {
        "name": "NumberOfFeatures",
        "value": "3.0"
      },
      {
        "name": "NumberOfInstances",
        "value": "5456.0"
      },
      {
        "name": "NumberOfInstancesWithMissingValues",
        "value": "0.0"
      },
      {
        "name": "NumberOfMissingValues",
        "value": "0.0"
      },
      {
        "name": "NumberOfNumericFeatures",
        "value": "2.0"
      },
      {
        "name": "NumberOfSymbolicFeatures",
        "value": "1.0"
      },
      {
        "name": "PercentageOfBinaryFeatures",
        "value": "0.0"
      },
      {
        "name": "PercentageOfInstancesWithMissingValues",
        "value": "0.0"
      },
      {
        "name": "PercentageOfMissingValues",
        "value": "0.0"
      },
      {
        "name": "PercentageOfNumericFeatures",
        "value": "66.66666666666666"
      },
      {
        "name": "PercentageOfSymbolicFeatures",
        "value": "33.33333333333333"
      },
      {
        "name": "Quartile1AttributeEntropy",
        "value": []
      },
      {
        "name": "Quartile1KurtosisOfNumericAtts",
        "value": "3.7711388729140243"
      },
      {
        "name": "Quartile1MeansOfNumericAtts",
        "value": "0.6812692448680352"
      },
      {
        "name": "Quartile1MutualInformation",
        "value": []
      },
      {
        "name": "Quartile1SkewnessOfNumericAtts",
        "value": "1.7488556923500649"
      },
      {
        "name": "Quartile1StdDevOfNumericAtts",
        "value": "0.34259423171428705"
      },
      {
        "name": "Quartile2AttributeEntropy",
        "value": []
      },
      {
        "name": "Quartile2KurtosisOfNumericAtts",
        "value": "20.919999260039127"
      },
      {
        "name": "Quartile2MeansOfNumericAtts",
        "value": "0.9857880315249266"
      },
      {
        "name": "Quartile2MutualInformation",
        "value": []
      },
      {
        "name": "Quartile2SkewnessOfNumericAtts",
        "value": "3.381802802687332"
      },
      {
        "name": "Quartile2StdDevOfNumericAtts",
        "value": "0.4846468978934752"
      },
      {
        "name": "Quartile3AttributeEntropy",
        "value": []
      },
      {
        "name": "Quartile3KurtosisOfNumericAtts",
        "value": "38.068859647164224"
      },
      {
        "name": "Quartile3MeansOfNumericAtts",
        "value": "1.290306818181818"
      },
      {
        "name": "Quartile3MutualInformation",
        "value": []
      },
      {
        "name": "Quartile3SkewnessOfNumericAtts",
        "value": "5.014749913024599"
      },
      {
        "name": "Quartile3StdDevOfNumericAtts",
        "value": "0.6266995640726634"
      },
      {
        "name": "REPTreeDepth1AUC",
        "value": "0.9999773385366949"
      },
      {
        "name": "REPTreeDepth1ErrRate",
        "value": "5.498533724340176E-4"
      },
      {
        "name": "REPTreeDepth1Kappa",
        "value": "0.99917015952882"
      },
      {
        "name": "REPTreeDepth2AUC",
        "value": "0.9999773385366949"
      },
      {
        "name": "REPTreeDepth2ErrRate",
        "value": "5.498533724340176E-4"
      },
      {
        "name": "REPTreeDepth2Kappa",
        "value": "0.99917015952882"
      },
      {
        "name": "REPTreeDepth3AUC",
        "value": "0.9999773385366949"
      },
      {
        "name": "REPTreeDepth3ErrRate",
        "value": "5.498533724340176E-4"
      },
      {
        "name": "REPTreeDepth3Kappa",
        "value": "0.99917015952882"
      },
      {
        "name": "RandomTreeDepth1AUC",
        "value": "1.0"
      },
      {
        "name": "RandomTreeDepth1ErrRate",
        "value": "0.0"
      },
      {
        "name": "RandomTreeDepth1Kappa",
        "value": "1.0"
      },
      {
        "name": "RandomTreeDepth2AUC",
        "value": "1.0"
      },
      {
        "name": "RandomTreeDepth2ErrRate",
        "value": "0.0"
      },
      {
        "name": "RandomTreeDepth2Kappa",
        "value": "1.0"
      },
      {
        "name": "RandomTreeDepth3AUC",
        "value": "1.0"
      },
      {
        "name": "RandomTreeDepth3ErrRate",
        "value": "0.0"
      },
      {
        "name": "RandomTreeDepth3Kappa",
        "value": "1.0"
      },
      {
        "name": "StdvNominalAttDistinctValues",
        "value": "0.0"
      },
      {
        "name": "kNN1NAUC",
        "value": "0.9899815470599038"
      },
      {
        "name": "kNN1NErrRate",
        "value": "0.014296187683284457"
      },
      {
        "name": "kNN1NKappa",
        "value": "0.9784115663454437"
      }
    ]
  }
}