{
  "data_qualities": {
    "quality": [
      {
        "name": "AutoCorrelation",
        "value": "0.6956521739130435"
      },
      {
        "name": "CfsSubsetEval_DecisionStumpAUC",
        "value": "0.6965054082765004"
      },
      {
        "name": "CfsSubsetEval_DecisionStumpErrRate",
        "value": "0.48936170212765956"
      },
      {
        "name": "CfsSubsetEval_DecisionStumpKappa",
        "value": "0.3231058234189104"
      },
      {
        "name": "CfsSubsetEval_NaiveBayesAUC",
        "value": "0.6965054082765004"
      },
      {
        "name": "CfsSubsetEval_NaiveBayesErrRate",
        "value": "0.48936170212765956"
      },
      {
        "name": "CfsSubsetEval_NaiveBayesKappa",
        "value": "0.3231058234189104"
      },
      {
        "name": "CfsSubsetEval_kNN1NAUC",
        "value": "0.6965054082765004"
      },
      {
        "name": "CfsSubsetEval_kNN1NErrRate",
        "value": "0.48936170212765956"
      },
      {
        "name": "CfsSubsetEval_kNN1NKappa",
        "value": "0.3231058234189104"
      },
      {
        "name": "ClassEntropy",
        "value": "2.1133380677649773"
      },
      {
        "name": "DecisionStumpAUC",
        "value": "0.6174973576043552"
      },
      {
        "name": "DecisionStumpErrRate",
        "value": "0.574468085106383"
      },
      {
        "name": "DecisionStumpKappa",
        "value": "0.12119113573407204"
      },
      {
        "name": "Dimensionality",
        "value": "1.9361702127659575"
      },
      {
        "name": "EquivalentNumberOfAtts",
        "value": []
      },
      {
        "name": "J48.00001.AUC",
        "value": "0.6403971263423508"
      },
      {
        "name": "J48.00001.ErrRate",
        "value": "0.574468085106383"
      },
      {
        "name": "J48.00001.Kappa",
        "value": "0.21618282890673252"
      },
      {
        "name": "J48.0001.AUC",
        "value": "0.6403971263423508"
      },
      {
        "name": "J48.0001.ErrRate",
        "value": "0.574468085106383"
      },
      {
        "name": "J48.0001.Kappa",
        "value": "0.21618282890673252"
      },
      {
        "name": "J48.001.AUC",
        "value": "0.6403971263423508"
      },
      {
        "name": "J48.001.ErrRate",
        "value": "0.574468085106383"
      },
      {
        "name": "J48.001.Kappa",
        "value": "0.21618282890673252"
      },
      {
        "name": "MajorityClassPercentage",
        "value": "42.5531914893617"
      },
      {
        "name": "MajorityClassSize",
        "value": "20.0"
      },
      {
        "name": "MaxAttributeEntropy",
        "value": []
      },
      {
        "name": "MaxKurtosisOfNumericAtts",
        "value": "40.403382507458026"
      },
      {
        "name": "MaxMeansOfNumericAtts",
        "value": "82.65957446808511"
      },
      {
        "name": "MaxMutualInformation",
        "value": []
      },
      {
        "name": "MaxNominalAttDistinctValues",
        "value": "5.0"
      },
      {
        "name": "MaxSkewnessOfNumericAtts",
        "value": "6.122173461505129"
      },
      {
        "name": "MaxStdDevOfNumericAtts",
        "value": "169.17932999757207"
      },
      {
        "name": "MeanAttributeEntropy",
        "value": []
      },
      {
        "name": "MeanKurtosisOfNumericAtts",
        "value": "4.848565957500776"
      },
      {
        "name": "MeanMeansOfNumericAtts",
        "value": "8.581560283687942"
      },
      {
        "name": "MeanMutualInformation",
        "value": []
      },
      {
        "name": "MeanNoiseToSignalRatio",
        "value": []
      },
      {
        "name": "MeanNominalAttDistinctValues",
        "value": "5.0"
      },
      {
        "name": "MeanSkewnessOfNumericAtts",
        "value": "0.07334167504794474"
      },
      {
        "name": "MeanStdDevOfNumericAtts",
        "value": "18.981014102740453"
      },
      {
        "name": "MinAttributeEntropy",
        "value": []
      },
      {
        "name": "MinKurtosisOfNumericAtts",
        "value": "-0.8047842658221485"
      },
      {
        "name": "MinMeansOfNumericAtts",
        "value": "-21.127659574468087"
      },
      {
        "name": "MinMutualInformation",
        "value": []
      },
      {
        "name": "MinNominalAttDistinctValues",
        "value": "5.0"
      },
      {
        "name": "MinSkewnessOfNumericAtts",
        "value": "-5.869723110426997"
      },
      {
        "name": "MinStdDevOfNumericAtts",
        "value": "3.320945219479886"
      },
      {
        "name": "MinorityClassPercentage",
        "value": "10.638297872340425"
      },
      {
        "name": "MinorityClassSize",
        "value": "5.0"
      },
      {
        "name": "NaiveBayesAUC",
        "value": "0.7438474848540946"
      },
      {
        "name": "NaiveBayesErrRate",
        "value": "0.44680851063829785"
      },
      {
        "name": "NaiveBayesKappa",
        "value": "0.3888544891640867"
      },
      {
        "name": "NumberOfBinaryFeatures",
        "value": "0.0"
      },
      {
        "name": "NumberOfClasses",
        "value": "5.0"
      },
      {
        "name": "NumberOfFeatures",
        "value": "91.0"
      },
      {
        "name": "NumberOfInstances",
        "value": "47.0"
      },
      {
        "name": "NumberOfInstancesWithMissingValues",
        "value": "0.0"
      },
      {
        "name": "NumberOfMissingValues",
        "value": "0.0"
      },
      {
        "name": "NumberOfNumericFeatures",
        "value": "90.0"
      },
      {
        "name": "NumberOfSymbolicFeatures",
        "value": "1.0"
      },
      {
        "name": "PercentageOfBinaryFeatures",
        "value": "0.0"
      },
      {
        "name": "PercentageOfInstancesWithMissingValues",
        "value": "0.0"
      },
      {
        "name": "PercentageOfMissingValues",
        "value": "0.0"
      },
      {
        "name": "PercentageOfNumericFeatures",
        "value": "98.9010989010989"
      },
      {
        "name": "PercentageOfSymbolicFeatures",
        "value": "1.098901098901099"
      },
      {
        "name": "Quartile1AttributeEntropy",
        "value": []
      },
      {
        "name": "Quartile1KurtosisOfNumericAtts",
        "value": "0.6307502547790199"
      },
      {
        "name": "Quartile1MeansOfNumericAtts",
        "value": "-8.101063829787234"
      },
      {
        "name": "Quartile1MutualInformation",
        "value": []
      },
      {
        "name": "Quartile1SkewnessOfNumericAtts",
        "value": "-0.46276698733821064"
      },
      {
        "name": "Quartile1StdDevOfNumericAtts",
        "value": "5.804291590673776"
      },
      {
        "name": "Quartile2AttributeEntropy",
        "value": []
      },
      {
        "name": "Quartile2KurtosisOfNumericAtts",
        "value": "2.8895563139462808"
      },
      {
        "name": "Quartile2MeansOfNumericAtts",
        "value": "-4.680851063829786"
      },
      {
        "name": "Quartile2MutualInformation",
        "value": []
      },
      {
        "name": "Quartile2SkewnessOfNumericAtts",
        "value": "0.29603793925421684"
      },
      {
        "name": "Quartile2StdDevOfNumericAtts",
        "value": "11.365276049291374"
      },
      {
        "name": "Quartile3AttributeEntropy",
        "value": []
      },
      {
        "name": "Quartile3KurtosisOfNumericAtts",
        "value": "5.319039692416794"
      },
      {
        "name": "Quartile3MeansOfNumericAtts",
        "value": "1.069148936170213"
      },
      {
        "name": "Quartile3MutualInformation",
        "value": []
      },
      {
        "name": "Quartile3SkewnessOfNumericAtts",
        "value": "0.7508433973407826"
      },
      {
        "name": "Quartile3StdDevOfNumericAtts",
        "value": "21.916341459299915"
      },
      {
        "name": "REPTreeDepth1AUC",
        "value": "0.5392936768780049"
      },
      {
        "name": "REPTreeDepth1ErrRate",
        "value": "0.574468085106383"
      },
      {
        "name": "REPTreeDepth1Kappa",
        "value": "0.01704105344694035"
      },
      {
        "name": "REPTreeDepth2AUC",
        "value": "0.5392936768780049"
      },
      {
        "name": "REPTreeDepth2ErrRate",
        "value": "0.574468085106383"
      },
      {
        "name": "REPTreeDepth2Kappa",
        "value": "0.01704105344694035"
      },
      {
        "name": "REPTreeDepth3AUC",
        "value": "0.5392936768780049"
      },
      {
        "name": "REPTreeDepth3ErrRate",
        "value": "0.574468085106383"
      },
      {
        "name": "REPTreeDepth3Kappa",
        "value": "0.01704105344694035"
      },
      {
        "name": "RandomTreeDepth1AUC",
        "value": "0.5869735313894493"
      },
      {
        "name": "RandomTreeDepth1ErrRate",
        "value": "0.6170212765957447"
      },
      {
        "name": "RandomTreeDepth1Kappa",
        "value": "0.13897662665824387"
      },
      {
        "name": "RandomTreeDepth2AUC",
        "value": "0.5869735313894493"
      },
      {
        "name": "RandomTreeDepth2ErrRate",
        "value": "0.6170212765957447"
      },
      {
        "name": "RandomTreeDepth2Kappa",
        "value": "0.13897662665824387"
      },
      {
        "name": "RandomTreeDepth3AUC",
        "value": "0.5869735313894493"
      },
      {
        "name": "RandomTreeDepth3ErrRate",
        "value": "0.6170212765957447"
      },
      {
        "name": "RandomTreeDepth3Kappa",
        "value": "0.13897662665824387"
      },
      {
        "name": "StdvNominalAttDistinctValues",
        "value": "0.0"
      },
      {
        "name": "kNN1NAUC",
        "value": "0.5752405360399789"
      },
      {
        "name": "kNN1NErrRate",
        "value": "0.5319148936170213"
      },
      {
        "name": "kNN1NKappa",
        "value": "0.16191155492154066"
      }
    ]
  }
}