{
  "data_set_description": {
    "creator": [
      "Pierre Mahé",
      "Jean-Baptiste Veyrieras"
    ],
    "default_target_attribute": "Class",
    "description": "**Author**: Pierre Mahé, Jean-Baptiste Veyrieras  \n**Source**: [UCI](https://archive.ics.uci.edu/ml/datasets/MicroMass) - 2014  \n**Please cite**:   \n\n### Description\n\nMicroMass (pure spectra version) is a dataset to explore machine learning approaches for the identification of microorganisms from mass-spectrometry data.  \n\n### Source\n```\nPierre Mahé, pierre.mahe '@' biomerieux.com, bioMérieux\nJean-Baptiste Veyrieras, jean-baptiste.veyrieras '@' biomerieux.com, bioMérieux\n```\n\n### Data Set Information\n\nThis MALDI-TOF dataset consists in:\n\na) A reference panel of 20 Gram positive and negative bacterial species covering 9 genera among which several species are known to be hard to discriminate by mass spectrometry (MALDI-TOF). Each species was represented by 11 to 60 mass spectra obtained from 7 to 20 bacterial strains, constituting altogether a dataset of 571 spectra obtained from 213 strains. The spectra were obtained according to the standard culture-based workflow used in clinical routine in which the microorganism was first grown on an agar plate for 24 to 48 hours before a portion of the colony was picked, spotted on a MALDI slide and a mass spectrum was acquired. \n\nb) Based on this reference panel, a dedicated in vitro mock-up mixture dataset was constituted. For that purpose we considered 10 pairs of species of various taxonomic proximity:\n* 4 mixtures, labeled A, B, C and D, involved species that belong to the same genus,  \n* 2 mixtures, labeled E and F, involved species that belong to distinct genera, but to the same Gram type,  \n* 4 mixtures, labeled G, H, I and J, involved species that belong to distinct Gram types.  \nEach mixture was represented by 2 pairs of strains, which were mixed according to the following 9 concentration ratios : 1:0, 10:1, 5:1, 2:1, 1:1, 1:2, 1:5, 1:10, 0:1. Two replicate spectra were acquired for each concentration ratio and each couple of strains, leading altogether to a dataset of 360 spectra, among which 80 are actually pure sample spectra.\n\n### Relevant Papers\n\nMahé et al. (2014). Automatic identification of mixed bacterial species fingerprints in a MALDI-TOF mass-spectrum. Bioinformatics.\n\nVervier et al., A benchmark of support vector machines strategies for microbial identification by mass-spectrometry data, submitted",
    "description_version": "1",
    "file_id": "1593707",
    "format": "ARFF",
    "id": "1515",
    "licence": "Public",
    "md5_checksum": "3eb0ad5e560b082f3f4bc2955ecdbec5",
    "minio_url": "https://data.openml.org/datasets/0000/1515/dataset_1515.pq",
    "name": "micro-mass",
    "original_data_url": "http://www.openml.org/d/1514",
    "parquet_url": "https://data.openml.org/datasets/0000/1515/dataset_1515.pq",
    "processing_date": "2018-10-03 21:35:54",
    "status": "active",
    "tag": [
      "Biology",
      "Data Science",
      "Machine Learning",
      "OpenML100",
      "study_123",
      "study_135",
      "study_14",
      "study_7"
    ],
    "upload_date": "2015-06-01T16:57:25",
    "url": "https://api.openml.org/data/v1/download/1593707/micro-mass.arff",
    "version": "2",
    "version_label": "2",
    "visibility": "public"
  }
}