{
  "data_set_description": {
    "default_target_attribute": "Class",
    "description": "**Author**: Pierre Mahé, Jean-Baptiste Veyrieras  \n**Source**: UCI    \n**Please cite**:   \n\n* Dataset Title: MicroMass - Mixed (mixed spectra version)   \n\n* Abstract:   \nA dataset to explore machine learning approaches for the identification of microorganisms from mass-spectrometry data.  \n\n* Source:\n\nPierre Mahé, pierre.mahe '@' biomerieux.com, bioMérieux\nJean-Baptiste Veyrieras, jean-baptiste.veyrieras '@' biomerieux.com, bioMérieux\n\n* Data Set Information:\n\nThis MALDI-TOF dataset consists in:\nA) A reference panel of 20 Gram positive and negative bacterial species covering 9 genera among which several species are known to be hard to discriminate by mass spectrometry (MALDI-TOF). Each species was represented by 11 to 60 mass spectra obtained from 7 to 20 bacterial strains, constituting altogether a dataset of 571 spectra obtained from 213 strains. The spectra were obtained according to the standard culture-based workflow used in clinical routine in which the microorganism was first grown on an agar plate for 24 to 48 hours, before a portion of colony was picked, spotted on a MALDI slide and a mass spectrum was acquired. \nB) Based on this reference panel, a dedicated in vitro mock-up mixture dataset was constituted. For that purpose we considered 10 pairs of species of various taxonomic proximity:\n* 4 mixtures, labelled A, B, C and D, involved species that belong to the same genus,  \n* 2 mixtures, labelled E and F, involved species that belong to distinct genera, but to the same Gram type,  \n* 4 mixtures, labelled G, H, I and J, involved species that belong to distinct Gram types.  \nEach mixture was represented by 2 pairs of strains, which were mixed according to the following 9 concentration ratios : 1:0, 10:1, 5:1, 2:1, 1:1, 1:2, 1:5, 1:10, 0:1. Two replicate spectra were acquired for each concentration ratio and each couple of strains, leading altogether to a dataset of 360 spectra, among which 80 are actually pure sample spectra.\n\n* Relevant Papers:\n\nMahé et al. (2014). Automatic identification of mixed bacterial species fingerprints in a MALDI-TOF mass-spectrum. Bioinformatics.\n\nVervier et al., A benchmark of support vector machines strategies for microbial identification by mass-spectrometry data, submitted",
    "description_version": "1",
    "file_id": "1593706",
    "format": "ARFF",
    "id": "1514",
    "licence": "Public",
    "md5_checksum": "4b5e29392272f2ff619ad39ab0458024",
    "minio_url": "https://data.openml.org/datasets/0000/1514/dataset_1514.pq",
    "name": "micro-mass",
    "parquet_url": "https://data.openml.org/datasets/0000/1514/dataset_1514.pq",
    "processing_date": "2018-10-03 21:36:06",
    "status": "active",
    "tag": [
      "Biology",
      "Data Science",
      "study_50",
      "study_7"
    ],
    "upload_date": "2015-06-01T16:42:12",
    "url": "https://api.openml.org/data/v1/download/1593706/micro-mass.arff",
    "version": "1",
    "visibility": "public"
  }
}