{
  "data_qualities": {
    "quality": [
      {
        "name": "AutoCorrelation",
        "value": "0.974933049704659"
      },
      {
        "name": "CfsSubsetEval_DecisionStumpAUC",
        "value": "0.5029906024441303"
      },
      {
        "name": "CfsSubsetEval_DecisionStumpErrRate",
        "value": "0.8969216276172243"
      },
      {
        "name": "CfsSubsetEval_DecisionStumpKappa",
        "value": "0.002950300346743878"
      },
      {
        "name": "CfsSubsetEval_NaiveBayesAUC",
        "value": "0.5029906024441303"
      },
      {
        "name": "CfsSubsetEval_NaiveBayesErrRate",
        "value": "0.8969216276172243"
      },
      {
        "name": "CfsSubsetEval_NaiveBayesKappa",
        "value": "0.002950300346743878"
      },
      {
        "name": "CfsSubsetEval_kNN1NAUC",
        "value": "0.5029906024441303"
      },
      {
        "name": "CfsSubsetEval_kNN1NErrRate",
        "value": "0.8969216276172243"
      },
      {
        "name": "CfsSubsetEval_kNN1NKappa",
        "value": "0.002950300346743878"
      },
      {
        "name": "ClassEntropy",
        "value": "3.3219134596906095"
      },
      {
        "name": "DecisionStumpAUC",
        "value": "0.5026282753562221"
      },
      {
        "name": "DecisionStumpErrRate",
        "value": "0.8969026346977846"
      },
      {
        "name": "DecisionStumpKappa",
        "value": "0.0028911460776816778"
      },
      {
        "name": "Dimensionality",
        "value": "5.697875831889871E-5"
      },
      {
        "name": "EquivalentNumberOfAtts",
        "value": []
      },
      {
        "name": "J48.00001.AUC",
        "value": "0.5158858250252059"
      },
      {
        "name": "J48.00001.ErrRate",
        "value": "0.8779742911842465"
      },
      {
        "name": "J48.00001.Kappa",
        "value": "0.024461871859540078"
      },
      {
        "name": "J48.0001.AUC",
        "value": "0.5158858250252059"
      },
      {
        "name": "J48.0001.ErrRate",
        "value": "0.8779742911842465"
      },
      {
        "name": "J48.0001.Kappa",
        "value": "0.024461871859540078"
      },
      {
        "name": "J48.001.AUC",
        "value": "0.5158858250252059"
      },
      {
        "name": "J48.001.ErrRate",
        "value": "0.8779742911842465"
      },
      {
        "name": "J48.001.Kappa",
        "value": "0.024461871859540078"
      },
      {
        "name": "MajorityClassPercentage",
        "value": "10.064727869450268"
      },
      {
        "name": "MajorityClassSize",
        "value": "26496.0"
      },
      {
        "name": "MaxAttributeEntropy",
        "value": []
      },
      {
        "name": "MaxKurtosisOfNumericAtts",
        "value": "1.648576087610421"
      },
      {
        "name": "MaxMeansOfNumericAtts",
        "value": "1.9802913769942592"
      },
      {
        "name": "MaxMutualInformation",
        "value": []
      },
      {
        "name": "MaxNominalAttDistinctValues",
        "value": "10.0"
      },
      {
        "name": "MaxSkewnessOfNumericAtts",
        "value": "0.21259968451177502"
      },
      {
        "name": "MaxStdDevOfNumericAtts",
        "value": "2.7502610946220982"
      },
      {
        "name": "MeanAttributeEntropy",
        "value": []
      },
      {
        "name": "MeanKurtosisOfNumericAtts",
        "value": "-0.07426195783948689"
      },
      {
        "name": "MeanMeansOfNumericAtts",
        "value": "-0.3030731541899604"
      },
      {
        "name": "MeanMutualInformation",
        "value": []
      },
      {
        "name": "MeanNoiseToSignalRatio",
        "value": []
      },
      {
        "name": "MeanNominalAttDistinctValues",
        "value": "10.0"
      },
      {
        "name": "MeanSkewnessOfNumericAtts",
        "value": "-0.15290016499842496"
      },
      {
        "name": "MeanStdDevOfNumericAtts",
        "value": "1.0689904235898917"
      },
      {
        "name": "MinAttributeEntropy",
        "value": []
      },
      {
        "name": "MinKurtosisOfNumericAtts",
        "value": "-1.9998911455615223"
      },
      {
        "name": "MinMeansOfNumericAtts",
        "value": "-3.079727172110038"
      },
      {
        "name": "MinMutualInformation",
        "value": []
      },
      {
        "name": "MinNominalAttDistinctValues",
        "value": "10.0"
      },
      {
        "name": "MinSkewnessOfNumericAtts",
        "value": "-0.745551866716224"
      },
      {
        "name": "MinStdDevOfNumericAtts",
        "value": "0.4999931969015846"
      },
      {
        "name": "MinorityClassPercentage",
        "value": "9.9234205488194"
      },
      {
        "name": "MinorityClassSize",
        "value": "26124.0"
      },
      {
        "name": "NaiveBayesAUC",
        "value": "0.5091089650379151"
      },
      {
        "name": "NaiveBayesErrRate",
        "value": "0.8940081137751846"
      },
      {
        "name": "NaiveBayesKappa",
        "value": "0.006552973733944797"
      },
      {
        "name": "NumberOfBinaryFeatures",
        "value": "0.0"
      },
      {
        "name": "NumberOfClasses",
        "value": "10.0"
      },
      {
        "name": "NumberOfFeatures",
        "value": "15.0"
      },
      {
        "name": "NumberOfInstances",
        "value": "263256.0"
      },
      {
        "name": "NumberOfInstancesWithMissingValues",
        "value": "0.0"
      },
      {
        "name": "NumberOfMissingValues",
        "value": "0.0"
      },
      {
        "name": "NumberOfNumericFeatures",
        "value": "14.0"
      },
      {
        "name": "NumberOfSymbolicFeatures",
        "value": "1.0"
      },
      {
        "name": "PercentageOfBinaryFeatures",
        "value": "0.0"
      },
      {
        "name": "PercentageOfInstancesWithMissingValues",
        "value": "0.0"
      },
      {
        "name": "PercentageOfMissingValues",
        "value": "0.0"
      },
      {
        "name": "PercentageOfNumericFeatures",
        "value": "93.33333333333333"
      },
      {
        "name": "PercentageOfSymbolicFeatures",
        "value": "6.666666666666667"
      },
      {
        "name": "Quartile1AttributeEntropy",
        "value": []
      },
      {
        "name": "Quartile1KurtosisOfNumericAtts",
        "value": "-0.3443078960855499"
      },
      {
        "name": "Quartile1MeansOfNumericAtts",
        "value": "-0.6352654173380667"
      },
      {
        "name": "Quartile1MutualInformation",
        "value": []
      },
      {
        "name": "Quartile1SkewnessOfNumericAtts",
        "value": "-0.35412910839906575"
      },
      {
        "name": "Quartile1StdDevOfNumericAtts",
        "value": "0.6197645427107618"
      },
      {
        "name": "Quartile2AttributeEntropy",
        "value": []
      },
      {
        "name": "Quartile2KurtosisOfNumericAtts",
        "value": "-0.05412750706886471"
      },
      {
        "name": "Quartile2MeansOfNumericAtts",
        "value": "-0.32072233078638257"
      },
      {
        "name": "Quartile2MutualInformation",
        "value": []
      },
      {
        "name": "Quartile2SkewnessOfNumericAtts",
        "value": "-0.07285308417633606"
      },
      {
        "name": "Quartile2StdDevOfNumericAtts",
        "value": "0.7824584862117689"
      },
      {
        "name": "Quartile3AttributeEntropy",
        "value": []
      },
      {
        "name": "Quartile3KurtosisOfNumericAtts",
        "value": "0.26805403904216607"
      },
      {
        "name": "Quartile3MeansOfNumericAtts",
        "value": "-0.14352131504125254"
      },
      {
        "name": "Quartile3MutualInformation",
        "value": []
      },
      {
        "name": "Quartile3SkewnessOfNumericAtts",
        "value": "-0.008621560573903397"
      },
      {
        "name": "Quartile3StdDevOfNumericAtts",
        "value": "1.4061398279267165"
      },
      {
        "name": "REPTreeDepth1AUC",
        "value": "0.5183145699593609"
      },
      {
        "name": "REPTreeDepth1ErrRate",
        "value": "0.8856512292217461"
      },
      {
        "name": "REPTreeDepth1Kappa",
        "value": "0.015921038439091397"
      },
      {
        "name": "REPTreeDepth2AUC",
        "value": "0.5183145699593609"
      },
      {
        "name": "REPTreeDepth2ErrRate",
        "value": "0.8856512292217461"
      },
      {
        "name": "REPTreeDepth2Kappa",
        "value": "0.015921038439091397"
      },
      {
        "name": "REPTreeDepth3AUC",
        "value": "0.5183145699593609"
      },
      {
        "name": "REPTreeDepth3ErrRate",
        "value": "0.8856512292217461"
      },
      {
        "name": "REPTreeDepth3Kappa",
        "value": "0.015921038439091397"
      },
      {
        "name": "RandomTreeDepth1AUC",
        "value": "0.5115969556370431"
      },
      {
        "name": "RandomTreeDepth1ErrRate",
        "value": "0.8791252621022883"
      },
      {
        "name": "RandomTreeDepth1Kappa",
        "value": "0.02319159820653007"
      },
      {
        "name": "RandomTreeDepth2AUC",
        "value": "0.5115969556370431"
      },
      {
        "name": "RandomTreeDepth2ErrRate",
        "value": "0.8791252621022883"
      },
      {
        "name": "RandomTreeDepth2Kappa",
        "value": "0.02319159820653007"
      },
      {
        "name": "RandomTreeDepth3AUC",
        "value": "0.5115969556370431"
      },
      {
        "name": "RandomTreeDepth3ErrRate",
        "value": "0.8791252621022883"
      },
      {
        "name": "RandomTreeDepth3Kappa",
        "value": "0.02319159820653007"
      },
      {
        "name": "StdvNominalAttDistinctValues",
        "value": "0.0"
      },
      {
        "name": "kNN1NAUC",
        "value": "0.5678629121994341"
      },
      {
        "name": "kNN1NErrRate",
        "value": "0.7779081958245966"
      },
      {
        "name": "kNN1NKappa",
        "value": "0.1356588902774972"
      }
    ]
  }
}