{
  "data_qualities": {
    "quality": [
      {
        "name": "AutoCorrelation",
        "value": "0.9959839357429718"
      },
      {
        "name": "CfsSubsetEval_DecisionStumpAUC",
        "value": "0.9926802169792824"
      },
      {
        "name": "CfsSubsetEval_DecisionStumpErrRate",
        "value": "0.016"
      },
      {
        "name": "CfsSubsetEval_DecisionStumpKappa",
        "value": "0.9671679033423074"
      },
      {
        "name": "CfsSubsetEval_NaiveBayesAUC",
        "value": "0.9926802169792824"
      },
      {
        "name": "CfsSubsetEval_NaiveBayesErrRate",
        "value": "0.016"
      },
      {
        "name": "CfsSubsetEval_NaiveBayesKappa",
        "value": "0.9671679033423074"
      },
      {
        "name": "CfsSubsetEval_kNN1NAUC",
        "value": "0.9926802169792824"
      },
      {
        "name": "CfsSubsetEval_kNN1NErrRate",
        "value": "0.016"
      },
      {
        "name": "CfsSubsetEval_kNN1NKappa",
        "value": "0.9671679033423074"
      },
      {
        "name": "ClassEntropy",
        "value": "0.9849900098451574"
      },
      {
        "name": "DecisionStumpAUC",
        "value": "0.9812430560094112"
      },
      {
        "name": "DecisionStumpErrRate",
        "value": "0.016"
      },
      {
        "name": "DecisionStumpKappa",
        "value": "0.9671679033423074"
      },
      {
        "name": "Dimensionality",
        "value": "0.028"
      },
      {
        "name": "EquivalentNumberOfAtts",
        "value": "2.650180766432113"
      },
      {
        "name": "J48.00001.AUC",
        "value": "0.9926802169792824"
      },
      {
        "name": "J48.00001.ErrRate",
        "value": "0.016"
      },
      {
        "name": "J48.00001.Kappa",
        "value": "0.9671679033423074"
      },
      {
        "name": "J48.0001.AUC",
        "value": "0.9926802169792824"
      },
      {
        "name": "J48.0001.ErrRate",
        "value": "0.016"
      },
      {
        "name": "J48.0001.Kappa",
        "value": "0.9671679033423074"
      },
      {
        "name": "J48.001.AUC",
        "value": "0.9926802169792824"
      },
      {
        "name": "J48.001.ErrRate",
        "value": "0.016"
      },
      {
        "name": "J48.001.Kappa",
        "value": "0.9671679033423074"
      },
      {
        "name": "MajorityClassPercentage",
        "value": "57.199999999999996"
      },
      {
        "name": "MajorityClassSize",
        "value": "143.0"
      },
      {
        "name": "MaxAttributeEntropy",
        "value": "1.583294791939475"
      },
      {
        "name": "MaxKurtosisOfNumericAtts",
        "value": []
      },
      {
        "name": "MaxMeansOfNumericAtts",
        "value": []
      },
      {
        "name": "MaxMutualInformation",
        "value": "0.9018339686776"
      },
      {
        "name": "MaxNominalAttDistinctValues",
        "value": "3.0"
      },
      {
        "name": "MaxSkewnessOfNumericAtts",
        "value": []
      },
      {
        "name": "MaxStdDevOfNumericAtts",
        "value": []
      },
      {
        "name": "MeanAttributeEntropy",
        "value": "1.544825719334025"
      },
      {
        "name": "MeanKurtosisOfNumericAtts",
        "value": []
      },
      {
        "name": "MeanMeansOfNumericAtts",
        "value": []
      },
      {
        "name": "MeanMutualInformation",
        "value": "0.37166899040295664"
      },
      {
        "name": "MeanNoiseToSignalRatio",
        "value": "3.1564557690410315"
      },
      {
        "name": "MeanNominalAttDistinctValues",
        "value": "2.857142857142857"
      },
      {
        "name": "MeanSkewnessOfNumericAtts",
        "value": []
      },
      {
        "name": "MeanStdDevOfNumericAtts",
        "value": []
      },
      {
        "name": "MinAttributeEntropy",
        "value": "1.5159539098717756"
      },
      {
        "name": "MinKurtosisOfNumericAtts",
        "value": []
      },
      {
        "name": "MinMeansOfNumericAtts",
        "value": []
      },
      {
        "name": "MinMutualInformation",
        "value": "0.04593317248947"
      },
      {
        "name": "MinNominalAttDistinctValues",
        "value": "2.0"
      },
      {
        "name": "MinSkewnessOfNumericAtts",
        "value": []
      },
      {
        "name": "MinStdDevOfNumericAtts",
        "value": []
      },
      {
        "name": "MinorityClassPercentage",
        "value": "42.8"
      },
      {
        "name": "MinorityClassSize",
        "value": "107.0"
      },
      {
        "name": "NaiveBayesAUC",
        "value": "0.9999346447944579"
      },
      {
        "name": "NaiveBayesErrRate",
        "value": "0.008"
      },
      {
        "name": "NaiveBayesKappa",
        "value": "0.9836611986144697"
      },
      {
        "name": "NumberOfBinaryFeatures",
        "value": "1.0"
      },
      {
        "name": "NumberOfClasses",
        "value": "2.0"
      },
      {
        "name": "NumberOfFeatures",
        "value": "7.0"
      },
      {
        "name": "NumberOfInstances",
        "value": "250.0"
      },
      {
        "name": "NumberOfInstancesWithMissingValues",
        "value": "0.0"
      },
      {
        "name": "NumberOfMissingValues",
        "value": "0.0"
      },
      {
        "name": "NumberOfNumericFeatures",
        "value": "0.0"
      },
      {
        "name": "NumberOfSymbolicFeatures",
        "value": "7.0"
      },
      {
        "name": "PercentageOfBinaryFeatures",
        "value": "14.285714285714285"
      },
      {
        "name": "PercentageOfInstancesWithMissingValues",
        "value": "0.0"
      },
      {
        "name": "PercentageOfMissingValues",
        "value": "0.0"
      },
      {
        "name": "PercentageOfNumericFeatures",
        "value": "0.0"
      },
      {
        "name": "PercentageOfSymbolicFeatures",
        "value": "100.0"
      },
      {
        "name": "Quartile1AttributeEntropy",
        "value": "1.5199316731785335"
      },
      {
        "name": "Quartile1KurtosisOfNumericAtts",
        "value": []
      },
      {
        "name": "Quartile1MeansOfNumericAtts",
        "value": []
      },
      {
        "name": "Quartile1MutualInformation",
        "value": "0.0554201077321875"
      },
      {
        "name": "Quartile1SkewnessOfNumericAtts",
        "value": []
      },
      {
        "name": "Quartile1StdDevOfNumericAtts",
        "value": []
      },
      {
        "name": "Quartile2AttributeEntropy",
        "value": "1.534677057219406"
      },
      {
        "name": "Quartile2KurtosisOfNumericAtts",
        "value": []
      },
      {
        "name": "Quartile2MeansOfNumericAtts",
        "value": []
      },
      {
        "name": "Quartile2MutualInformation",
        "value": "0.31958049335058997"
      },
      {
        "name": "Quartile2SkewnessOfNumericAtts",
        "value": []
      },
      {
        "name": "Quartile2StdDevOfNumericAtts",
        "value": []
      },
      {
        "name": "Quartile3AttributeEntropy",
        "value": "1.5801441270898446"
      },
      {
        "name": "Quartile3KurtosisOfNumericAtts",
        "value": []
      },
      {
        "name": "Quartile3MeansOfNumericAtts",
        "value": []
      },
      {
        "name": "Quartile3MutualInformation",
        "value": "0.6638360384716975"
      },
      {
        "name": "Quartile3SkewnessOfNumericAtts",
        "value": []
      },
      {
        "name": "Quartile3StdDevOfNumericAtts",
        "value": []
      },
      {
        "name": "REPTreeDepth1AUC",
        "value": "0.9926802169792824"
      },
      {
        "name": "REPTreeDepth1ErrRate",
        "value": "0.016"
      },
      {
        "name": "REPTreeDepth1Kappa",
        "value": "0.9671679033423074"
      },
      {
        "name": "REPTreeDepth2AUC",
        "value": "0.9926802169792824"
      },
      {
        "name": "REPTreeDepth2ErrRate",
        "value": "0.016"
      },
      {
        "name": "REPTreeDepth2Kappa",
        "value": "0.9671679033423074"
      },
      {
        "name": "REPTreeDepth3AUC",
        "value": "0.9926802169792824"
      },
      {
        "name": "REPTreeDepth3ErrRate",
        "value": "0.016"
      },
      {
        "name": "REPTreeDepth3Kappa",
        "value": "0.9671679033423074"
      },
      {
        "name": "RandomTreeDepth1AUC",
        "value": "0.9883340958107313"
      },
      {
        "name": "RandomTreeDepth1ErrRate",
        "value": "0.012"
      },
      {
        "name": "RandomTreeDepth1Kappa",
        "value": "0.9755205953391213"
      },
      {
        "name": "RandomTreeDepth2AUC",
        "value": "0.9883340958107313"
      },
      {
        "name": "RandomTreeDepth2ErrRate",
        "value": "0.012"
      },
      {
        "name": "RandomTreeDepth2Kappa",
        "value": "0.9755205953391213"
      },
      {
        "name": "RandomTreeDepth3AUC",
        "value": "0.9883340958107313"
      },
      {
        "name": "RandomTreeDepth3ErrRate",
        "value": "0.012"
      },
      {
        "name": "RandomTreeDepth3Kappa",
        "value": "0.9755205953391213"
      },
      {
        "name": "StdvNominalAttDistinctValues",
        "value": "0.37796447300922725"
      },
      {
        "name": "kNN1NAUC",
        "value": "1.0"
      },
      {
        "name": "kNN1NErrRate",
        "value": "0.004"
      },
      {
        "name": "kNN1NKappa",
        "value": "0.9918401984463737"
      }
    ]
  }
}