{
  "data_set_description": {
    "default_target_attribute": "Class",
    "description": "**Author**: Lee Graham, Franz Oppacher  \n**Source**: [UCI](http://archive.ics.uci.edu/ml/datasets/hill-valley)  \n**Please cite**:   \n\nEach record represents 100 points on a two-dimensional graph. When plotted in order (from 1 through 100) as the Y coordinate, the points will create either a Hill (a “bump” in the terrain) or a Valley (a “dip” in the terrain). \nSee the original source for some examples of these graphs. \n\nIn the original form, there are six files. This is the non-noisy version, with training and test sets merged. \n\n### Attribute Information:\n\n1-100: Labeled “X##”. Floating point values (numeric), the Y-values of the graphs.  \n101: Labeled “class”. Binary {0, 1} representing {valley, hill}",
    "description_version": "1",
    "file_id": "1590101",
    "format": "ARFF",
    "id": "1479",
    "licence": "Public",
    "md5_checksum": "347b591c7006712869fcae81a88dc0db",
    "minio_url": "https://data.openml.org/datasets/0000/1479/dataset_1479.pq",
    "name": "hill-valley",
    "parquet_url": "https://data.openml.org/datasets/0000/1479/dataset_1479.pq",
    "processing_date": "2018-10-03 21:38:13",
    "status": "active",
    "tag": [
      "artificial",
      "Data Science",
      "OpenML100",
      "study_123",
      "study_135",
      "study_14",
      "study_190",
      "study_50",
      "study_52",
      "study_7"
    ],
    "upload_date": "2015-05-22T21:11:58",
    "url": "https://api.openml.org/data/v1/download/1590101/hill-valley.arff",
    "version": "1",
    "visibility": "public"
  }
}