{
  "data_set_description": {
    "creator": [
      "Hans Bauer Jesus",
      "Deter Bergman"
    ],
    "default_target_attribute": "def",
    "description": "**Author**: Hans Bauer Jesus\",\"Deter Bergman  \n**Source**: Unknown - Date unknown  \n**Please cite**:   \n\npie chart 1",
    "description_version": "1",
    "file_id": "1583317",
    "format": "ARFF",
    "id": "1451",
    "licence": "Public",
    "md5_checksum": "1fcaa655ba7e5484d39f1a925b026c80",
    "minio_url": "https://data.openml.org/datasets/0000/1451/dataset_1451.pq",
    "name": "PieChart1",
    "parquet_url": "https://data.openml.org/datasets/0000/1451/dataset_1451.pq",
    "processing_date": "2018-10-03 21:45:12",
    "status": "active",
    "tag": [
      "Data Visualization",
      "Mathematics",
      "origin_unknown",
      "Science",
      "study_52",
      "study_7"
    ],
    "upload_date": "2015-05-20T15:56:42",
    "url": "https://api.openml.org/data/v1/download/1583317/PieChart1.arff",
    "version": "1",
    "version_label": "1",
    "visibility": "public"
  }
}