{
  "data_set_description": {
    "creator": [
      "Hans Bauer Jesus",
      "Deter Bergman"
    ],
    "default_target_attribute": "def",
    "description": "**Author**: Hans Bauer Jesus\",\"Deter Bergman  \n**Source**: Unknown - Date unknown  \n**Please cite**:   \n\ncast metal 1",
    "description_version": "1",
    "file_id": "1583313",
    "format": "ARFF",
    "id": "1447",
    "licence": "Public",
    "md5_checksum": "23212a6f2dcdfdd80fcf96c08d0c0be5",
    "minio_url": "https://data.openml.org/datasets/0000/1447/dataset_1447.pq",
    "name": "CastMetal1",
    "parquet_url": "https://data.openml.org/datasets/0000/1447/dataset_1447.pq",
    "processing_date": "2018-10-03 21:35:54",
    "status": "active",
    "tag": [
      "Metalworking",
      "mf_less_than_80",
      "Research",
      "Study",
      "study_123",
      "study_52",
      "study_7",
      "study_88",
      "Technology"
    ],
    "upload_date": "2015-05-20T15:54:47",
    "url": "https://api.openml.org/data/v1/download/1583313/CastMetal1.arff",
    "version": "1",
    "version_label": "1",
    "visibility": "public"
  }
}