{
  "data_set_description": {
    "citation": "Shirish Krishnaj Shevade and S. Sathiya Keerthi.\nA simple and efficient algorithm for gene selection using sparse logistic regression.\nBioinformatics, 19(17):2246-2253, 2003.",
    "contributor": [
      "libSVM",
      "AAD group"
    ],
    "creator": "Shirish Krishnaj Shevade and S. Sathiya Keerthi.",
    "default_target_attribute": "class",
    "description": "**Author**: Shirish Krishnaj Shevade and S. Sathiya Keerthi.  \nlibSVM\",\"AAD group  \n**Source**: [original](http://www.csie.ntu.edu.tw/~cjlin/libsvmtools/datasets/binary.html) - Date unknown  \n**Please cite**: Shirish Krishnaj Shevade and S. Sathiya Keerthi.\nA simple and efficient algorithm for gene selection using sparse logistic regression.\nBioinformatics, 19(17):2246-2253, 2003.  \n\n#Dataset from the LIBSVM data repository.\n\nPreprocessing: Instance-wise normalization to mean zero and variance one. Then feature-wise normalization to mean zero and variance one. The original dataset consists of 49 instances. Five are removed since the classification results using immunohistochemistry and protein immunoblotting assay confilcted. Of the remaining, two instances were rejected due to failed array hybridization. The rest data are further splited into training (38), and validation (4).",
    "description_version": "1",
    "file_id": "1426694",
    "format": "Sparse_ARFF",
    "id": "1434",
    "licence": "Public",
    "md5_checksum": "be77f0db32b881ed429b3657d0cc927b",
    "name": "duke-breast-cancer",
    "original_data_url": "http://www.csie.ntu.edu.tw/~cjlin/libsvmtools/datasets/binary.html",
    "processing_date": "2020-11-20 21:36:06",
    "status": "active",
    "upload_date": "2015-04-27T16:19:03",
    "url": "https://api.openml.org/data/v1/download/1426694/duke-breast-cancer.sparse_arff",
    "version": "1",
    "visibility": "public"
  }
}