{
  "data_set_description": {
    "citation": "http://archive.ics.uci.edu/ml/datasets/Adult",
    "contributor": [
      "libSVM",
      "AAD group"
    ],
    "creator": [
      "Ronny Kohavi",
      "Barry Becker"
    ],
    "default_target_attribute": "class",
    "description": "**Author**: Ronny Kohavi\",\"Barry Becker  \nlibSVM\",\"AAD group  \n**Source**: [original](http://www.csie.ntu.edu.tw/~cjlin/libsvmtools/datasets/binary.html) - Date unknown  \n**Please cite**: http://archive.ics.uci.edu/ml/datasets/Adult  \n\n#Dataset from the LIBSVM data repository.\n\nPreprocessing: The original Adult data set has 14 features, among which six are continuous and eight are categorical. In this data set, continuous features are discretized into quantiles, and each quantile is represented by a binary feature. Also, a categorical feature with m categories is converted to m binary features. Details on how each feature is converted can be found in the beginning of each file from this page. \nhttp://research.microsoft.com/en-us/um/people/jplatt/adult.zip",
    "description_version": "1",
    "file_id": "1426441",
    "format": "Sparse_ARFF",
    "id": "1425",
    "licence": "Public",
    "md5_checksum": "bf2b6b7278d24371d28905dc350cc173",
    "name": "a4a",
    "original_data_url": "http://www.csie.ntu.edu.tw/~cjlin/libsvmtools/datasets/binary.html",
    "processing_date": "2020-11-20 22:08:16",
    "status": "active",
    "upload_date": "2015-04-27T12:45:13",
    "url": "https://api.openml.org/data/v1/download/1426441/a4a.sparse_arff",
    "version": "1",
    "visibility": "public"
  }
}