{
  "data_qualities": {
    "quality": [
      {
        "name": "AutoCorrelation",
        "value": "0.46374446374446376"
      },
      {
        "name": "CfsSubsetEval_DecisionStumpAUC",
        "value": "0.6420895719142502"
      },
      {
        "name": "CfsSubsetEval_DecisionStumpErrRate",
        "value": "0.398696"
      },
      {
        "name": "CfsSubsetEval_DecisionStumpKappa",
        "value": "0.20315864334172956"
      },
      {
        "name": "CfsSubsetEval_NaiveBayesAUC",
        "value": "0.6420895719142502"
      },
      {
        "name": "CfsSubsetEval_NaiveBayesErrRate",
        "value": "0.398696"
      },
      {
        "name": "CfsSubsetEval_NaiveBayesKappa",
        "value": "0.20315864334172956"
      },
      {
        "name": "CfsSubsetEval_kNN1NAUC",
        "value": "0.6420895719142502"
      },
      {
        "name": "CfsSubsetEval_kNN1NErrRate",
        "value": "0.398696"
      },
      {
        "name": "CfsSubsetEval_kNN1NKappa",
        "value": "0.20315864334172956"
      },
      {
        "name": "ClassEntropy",
        "value": "1.2562056674968567"
      },
      {
        "name": "DecisionStumpAUC",
        "value": "0.5789177256847966"
      },
      {
        "name": "DecisionStumpErrRate",
        "value": "0.456505"
      },
      {
        "name": "DecisionStumpKappa",
        "value": "0.0"
      },
      {
        "name": "Dimensionality",
        "value": "1.9E-5"
      },
      {
        "name": "EquivalentNumberOfAtts",
        "value": "283.05901525192337"
      },
      {
        "name": "J48.00001.AUC",
        "value": "0.7196430597022656"
      },
      {
        "name": "J48.00001.ErrRate",
        "value": "0.324881"
      },
      {
        "name": "J48.00001.Kappa",
        "value": "0.36757368607270147"
      },
      {
        "name": "J48.0001.AUC",
        "value": "0.7196430597022656"
      },
      {
        "name": "J48.0001.ErrRate",
        "value": "0.324881"
      },
      {
        "name": "J48.0001.Kappa",
        "value": "0.36757368607270147"
      },
      {
        "name": "J48.001.AUC",
        "value": "0.7196430597022656"
      },
      {
        "name": "J48.001.ErrRate",
        "value": "0.324881"
      },
      {
        "name": "J48.001.Kappa",
        "value": "0.36757368607270147"
      },
      {
        "name": "MajorityClassPercentage",
        "value": "54.34949999999999"
      },
      {
        "name": "MajorityClassSize",
        "value": "543495.0"
      },
      {
        "name": "MaxAttributeEntropy",
        "value": "2.9898810484870033"
      },
      {
        "name": "MaxKurtosisOfNumericAtts",
        "value": "-0.7754206589539474"
      },
      {
        "name": "MaxMeansOfNumericAtts",
        "value": "3.173800424546988"
      },
      {
        "name": "MaxMutualInformation",
        "value": "0.02302323665027"
      },
      {
        "name": "MaxNominalAttDistinctValues",
        "value": "8.0"
      },
      {
        "name": "MaxSkewnessOfNumericAtts",
        "value": "0.9467075497753543"
      },
      {
        "name": "MaxStdDevOfNumericAtts",
        "value": "2.108608738213675"
      },
      {
        "name": "MeanAttributeEntropy",
        "value": "1.3704277151301583"
      },
      {
        "name": "MeanKurtosisOfNumericAtts",
        "value": "-0.9770981082239939"
      },
      {
        "name": "MeanMeansOfNumericAtts",
        "value": "2.3802294748491133"
      },
      {
        "name": "MeanMutualInformation",
        "value": "0.004437963816057333"
      },
      {
        "name": "MeanNoiseToSignalRatio",
        "value": "307.7965048682258"
      },
      {
        "name": "MeanNominalAttDistinctValues",
        "value": "3.0"
      },
      {
        "name": "MeanSkewnessOfNumericAtts",
        "value": "0.596416852513672"
      },
      {
        "name": "MeanStdDevOfNumericAtts",
        "value": "1.342482232701586"
      },
      {
        "name": "MinAttributeEntropy",
        "value": "0.8118735266411505"
      },
      {
        "name": "MinKurtosisOfNumericAtts",
        "value": "-1.2709718866946118"
      },
      {
        "name": "MinMeansOfNumericAtts",
        "value": "1.5681490000004366"
      },
      {
        "name": "MinMutualInformation",
        "value": "1.9385223085E-4"
      },
      {
        "name": "MinNominalAttDistinctValues",
        "value": "2.0"
      },
      {
        "name": "MinSkewnessOfNumericAtts",
        "value": "0.14178532483524584"
      },
      {
        "name": "MinStdDevOfNumericAtts",
        "value": "0.8306241049490591"
      },
      {
        "name": "MinorityClassPercentage",
        "value": "1.6507999999999998"
      },
      {
        "name": "MinorityClassSize",
        "value": "16508.0"
      },
      {
        "name": "NaiveBayesAUC",
        "value": "0.6560742072706345"
      },
      {
        "name": "NaiveBayesErrRate",
        "value": "0.405081"
      },
      {
        "name": "NaiveBayesKappa",
        "value": "0.18927429509328225"
      },
      {
        "name": "NumberOfBinaryFeatures",
        "value": "9.0"
      },
      {
        "name": "NumberOfClasses",
        "value": "4.0"
      },
      {
        "name": "NumberOfFeatures",
        "value": "19.0"
      },
      {
        "name": "NumberOfInstances",
        "value": "1000000.0"
      },
      {
        "name": "NumberOfInstancesWithMissingValues",
        "value": "0.0"
      },
      {
        "name": "NumberOfMissingValues",
        "value": "0.0"
      },
      {
        "name": "NumberOfNumericFeatures",
        "value": "3.0"
      },
      {
        "name": "NumberOfSymbolicFeatures",
        "value": "16.0"
      },
      {
        "name": "PercentageOfBinaryFeatures",
        "value": "47.368421052631575"
      },
      {
        "name": "PercentageOfInstancesWithMissingValues",
        "value": "0.0"
      },
      {
        "name": "PercentageOfMissingValues",
        "value": "0.0"
      },
      {
        "name": "PercentageOfNumericFeatures",
        "value": "15.789473684210526"
      },
      {
        "name": "PercentageOfSymbolicFeatures",
        "value": "84.21052631578947"
      },
      {
        "name": "Quartile1AttributeEntropy",
        "value": "0.9642410160148445"
      },
      {
        "name": "Quartile1KurtosisOfNumericAtts",
        "value": "-1.2709718866946118"
      },
      {
        "name": "Quartile1MeansOfNumericAtts",
        "value": "1.5681490000004366"
      },
      {
        "name": "Quartile1MutualInformation",
        "value": "0.00111359371469"
      },
      {
        "name": "Quartile1SkewnessOfNumericAtts",
        "value": "0.14178532483524584"
      },
      {
        "name": "Quartile1StdDevOfNumericAtts",
        "value": "0.8306241049490591"
      },
      {
        "name": "Quartile2AttributeEntropy",
        "value": "0.9934681828838101"
      },
      {
        "name": "Quartile2KurtosisOfNumericAtts",
        "value": "-0.8849017790234224"
      },
      {
        "name": "Quartile2MeansOfNumericAtts",
        "value": "2.3987389999999156"
      },
      {
        "name": "Quartile2MutualInformation",
        "value": "0.00201892797326"
      },
      {
        "name": "Quartile2SkewnessOfNumericAtts",
        "value": "0.700757682930416"
      },
      {
        "name": "Quartile2StdDevOfNumericAtts",
        "value": "1.0882138549420235"
      },
      {
        "name": "Quartile3AttributeEntropy",
        "value": "1.9140843062080601"
      },
      {
        "name": "Quartile3KurtosisOfNumericAtts",
        "value": "-0.7754206589539474"
      },
      {
        "name": "Quartile3MeansOfNumericAtts",
        "value": "3.173800424546988"
      },
      {
        "name": "Quartile3MutualInformation",
        "value": "0.00432113295513"
      },
      {
        "name": "Quartile3SkewnessOfNumericAtts",
        "value": "0.9467075497753543"
      },
      {
        "name": "Quartile3StdDevOfNumericAtts",
        "value": "2.108608738213675"
      },
      {
        "name": "REPTreeDepth1AUC",
        "value": "0.717630952465101"
      },
      {
        "name": "REPTreeDepth1ErrRate",
        "value": "0.345569"
      },
      {
        "name": "REPTreeDepth1Kappa",
        "value": "0.32193134048564215"
      },
      {
        "name": "REPTreeDepth2AUC",
        "value": "0.717630952465101"
      },
      {
        "name": "REPTreeDepth2ErrRate",
        "value": "0.345569"
      },
      {
        "name": "REPTreeDepth2Kappa",
        "value": "0.32193134048564215"
      },
      {
        "name": "REPTreeDepth3AUC",
        "value": "0.717630952465101"
      },
      {
        "name": "REPTreeDepth3ErrRate",
        "value": "0.345569"
      },
      {
        "name": "REPTreeDepth3Kappa",
        "value": "0.32193134048564215"
      },
      {
        "name": "RandomTreeDepth1AUC",
        "value": "0.6220357147354655"
      },
      {
        "name": "RandomTreeDepth1ErrRate",
        "value": "0.412858"
      },
      {
        "name": "RandomTreeDepth1Kappa",
        "value": "0.2291280831135609"
      },
      {
        "name": "RandomTreeDepth2AUC",
        "value": "0.6220357147354655"
      },
      {
        "name": "RandomTreeDepth2ErrRate",
        "value": "0.412858"
      },
      {
        "name": "RandomTreeDepth2Kappa",
        "value": "0.2291280831135609"
      },
      {
        "name": "RandomTreeDepth3AUC",
        "value": "0.6220357147354655"
      },
      {
        "name": "RandomTreeDepth3ErrRate",
        "value": "0.412858"
      },
      {
        "name": "RandomTreeDepth3Kappa",
        "value": "0.2291280831135609"
      },
      {
        "name": "StdvNominalAttDistinctValues",
        "value": "1.591644851508443"
      },
      {
        "name": "kNN1NAUC",
        "value": "0.6513923728696129"
      },
      {
        "name": "kNN1NErrRate",
        "value": "0.388433"
      },
      {
        "name": "kNN1NKappa",
        "value": "0.2671807694731802"
      }
    ]
  }
}