{
  "data_set_description": {
    "collection_date": "2015-02-23 15:37:32",
    "creator": [
      "Geoffrey Holmes",
      "Bernhard Pfahringer",
      "Jan van Rijn",
      "Joaquin Vanschoren"
    ],
    "default_target_attribute": "class",
    "description": [],
    "description_version": "1",
    "file_id": "584486",
    "format": "ARFF",
    "id": "1407",
    "licence": "public domain",
    "md5_checksum": "d467f1fd278c64ed6d16f38a99469226",
    "minio_url": "https://data.openml.org/datasets/0000/1407/dataset_1407.pq",
    "name": "BNG(lymph,5000,10)",
    "parquet_url": "https://data.openml.org/datasets/0000/1407/dataset_1407.pq",
    "processing_date": "2020-11-20 21:11:27",
    "status": "active",
    "tag": [
      "artificial",
      "Biology",
      "BNG",
      "Health",
      "Lymphatic System",
      "Medical"
    ],
    "upload_date": "2015-02-23T03:38:34",
    "url": "https://api.openml.org/data/v1/download/584486/BNG(lymph,5000,10).arff",
    "version": "1",
    "visibility": "public"
  }
}