{
  "data_set_description": {
    "collection_date": "2015-02-23 15:36:13",
    "creator": [
      "Geoffrey Holmes",
      "Bernhard Pfahringer",
      "Jan van Rijn",
      "Joaquin Vanschoren"
    ],
    "default_target_attribute": "class",
    "description": [],
    "description_version": "1",
    "file_id": "584481",
    "format": "ARFF",
    "id": "1406",
    "licence": "public domain",
    "md5_checksum": "9fb6b39f37fafa5d08fefad3d7e18a97",
    "minio_url": "https://data.openml.org/datasets/0000/1406/dataset_1406.pq",
    "name": "BNG(lymph,5000,5)",
    "parquet_url": "https://data.openml.org/datasets/0000/1406/dataset_1406.pq",
    "processing_date": "2020-11-20 21:40:33",
    "status": "active",
    "tag": [
      "artificial",
      "Biology",
      "BNG",
      "Health",
      "Lymphatic System",
      "Medical"
    ],
    "upload_date": "2015-02-23T03:37:14",
    "url": "https://api.openml.org/data/v1/download/584481/BNG(lymph,5000,5).arff",
    "version": "1",
    "visibility": "public"
  }
}