{
  "data_set_description": {
    "collection_date": "2015-02-23 15:30:52",
    "creator": [
      "Geoffrey Holmes",
      "Bernhard Pfahringer",
      "Jan van Rijn",
      "Joaquin Vanschoren"
    ],
    "default_target_attribute": "class",
    "description": [],
    "description_version": "1",
    "file_id": "584465",
    "format": "ARFF",
    "id": "1402",
    "licence": "public domain",
    "md5_checksum": "9b18b3ec3542ce19a58a4bc4d30ba96b",
    "minio_url": "https://data.openml.org/datasets/0000/1402/dataset_1402.pq",
    "name": "BNG(lymph,1000,1)",
    "parquet_url": "https://data.openml.org/datasets/0000/1402/dataset_1402.pq",
    "processing_date": "2018-10-03 21:37:35",
    "status": "active",
    "tag": [
      "artificial",
      "Biology",
      "BNG",
      "Health",
      "Lymphatic System",
      "Medical"
    ],
    "upload_date": "2015-02-23T03:31:54",
    "url": "https://api.openml.org/data/v1/download/584465/BNG(lymph,1000,1).arff",
    "version": "1",
    "visibility": "public"
  }
}