{
  "data_set_description": {
    "collection_date": "2015-02-23 14:54:56",
    "creator": [
      "Geoffrey Holmes",
      "Bernhard Pfahringer",
      "Jan van Rijn",
      "Joaquin Vanschoren"
    ],
    "default_target_attribute": "symboling",
    "description": [],
    "description_version": "1",
    "file_id": "584308",
    "format": "ARFF",
    "id": "1397",
    "licence": "public domain",
    "md5_checksum": "fc15efeef9e75a44745fccf0fefa833c",
    "minio_url": "https://data.openml.org/datasets/0000/1397/dataset_1397.pq",
    "name": "BNG(autos,5000,5)",
    "parquet_url": "https://data.openml.org/datasets/0000/1397/dataset_1397.pq",
    "processing_date": "2020-11-20 20:48:36",
    "status": "active",
    "tag": [
      "artificial",
      "Automobiles",
      "BNG",
      "Data",
      "Engineering",
      "Manufacturing",
      "Statistics"
    ],
    "upload_date": "2015-02-23T02:57:12",
    "url": "https://api.openml.org/data/v1/download/584308/BNG(autos,5000,5).arff",
    "version": "1",
    "visibility": "public"
  }
}