{
  "data_set_description": {
    "collection_date": "2015-02-23 11:32:55",
    "creator": [
      "Geoffrey Holmes",
      "Bernhard Pfahringer",
      "Jan van Rijn",
      "Joaquin Vanschoren"
    ],
    "default_target_attribute": "class",
    "description": [],
    "description_version": "1",
    "file_id": "583820",
    "format": "ARFF",
    "id": "1381",
    "licence": "public domain",
    "md5_checksum": "b6af21fc8f5002d316e39a0860f0faf6",
    "minio_url": "https://data.openml.org/datasets/0000/1381/dataset_1381.pq",
    "name": "BNG(letter,5000,1)",
    "parquet_url": "https://data.openml.org/datasets/0000/1381/dataset_1381.pq",
    "processing_date": "2020-11-20 21:05:45",
    "status": "active",
    "tag": [
      "artificial",
      "BNG",
      "Mathematics"
    ],
    "upload_date": "2015-02-22T23:33:44",
    "url": "https://api.openml.org/data/v1/download/583820/BNG(letter,5000,1).arff",
    "version": "1",
    "visibility": "public"
  }
}