{
  "data_qualities": {
    "quality": [
      {
        "name": "AutoCorrelation",
        "value": "0.03861203861203861"
      },
      {
        "name": "CfsSubsetEval_DecisionStumpAUC",
        "value": "0.7787475652866745"
      },
      {
        "name": "CfsSubsetEval_DecisionStumpErrRate",
        "value": "0.454085"
      },
      {
        "name": "CfsSubsetEval_DecisionStumpKappa",
        "value": "0.5277357941818792"
      },
      {
        "name": "CfsSubsetEval_NaiveBayesAUC",
        "value": "0.7787475652866745"
      },
      {
        "name": "CfsSubsetEval_NaiveBayesErrRate",
        "value": "0.454085"
      },
      {
        "name": "CfsSubsetEval_NaiveBayesKappa",
        "value": "0.5277357941818792"
      },
      {
        "name": "CfsSubsetEval_kNN1NAUC",
        "value": "0.7787475652866745"
      },
      {
        "name": "CfsSubsetEval_kNN1NErrRate",
        "value": "0.454085"
      },
      {
        "name": "CfsSubsetEval_kNN1NKappa",
        "value": "0.5277357941818792"
      },
      {
        "name": "ClassEntropy",
        "value": "4.699916919215081"
      },
      {
        "name": "DecisionStumpAUC",
        "value": "0.6194185624703475"
      },
      {
        "name": "DecisionStumpErrRate",
        "value": "0.934316"
      },
      {
        "name": "DecisionStumpKappa",
        "value": "0.02667791435353104"
      },
      {
        "name": "Dimensionality",
        "value": "1.7E-5"
      },
      {
        "name": "EquivalentNumberOfAtts",
        "value": []
      },
      {
        "name": "J48.00001.AUC",
        "value": "0.7917274483775862"
      },
      {
        "name": "J48.00001.ErrRate",
        "value": "0.423187"
      },
      {
        "name": "J48.00001.Kappa",
        "value": "0.559870780241616"
      },
      {
        "name": "J48.0001.AUC",
        "value": "0.7917274483775862"
      },
      {
        "name": "J48.0001.ErrRate",
        "value": "0.423187"
      },
      {
        "name": "J48.0001.Kappa",
        "value": "0.559870780241616"
      },
      {
        "name": "J48.001.AUC",
        "value": "0.7917274483775862"
      },
      {
        "name": "J48.001.ErrRate",
        "value": "0.423187"
      },
      {
        "name": "J48.001.Kappa",
        "value": "0.559870780241616"
      },
      {
        "name": "MajorityClassPercentage",
        "value": "4.0765"
      },
      {
        "name": "MajorityClassSize",
        "value": "40765.0"
      },
      {
        "name": "MaxAttributeEntropy",
        "value": []
      },
      {
        "name": "MaxKurtosisOfNumericAtts",
        "value": "1.031943229357736"
      },
      {
        "name": "MaxMeansOfNumericAtts",
        "value": "8.55365950634412"
      },
      {
        "name": "MaxMutualInformation",
        "value": []
      },
      {
        "name": "MaxNominalAttDistinctValues",
        "value": "26.0"
      },
      {
        "name": "MaxSkewnessOfNumericAtts",
        "value": "1.0231340671956344"
      },
      {
        "name": "MaxStdDevOfNumericAtts",
        "value": "3.3240988468485932"
      },
      {
        "name": "MeanAttributeEntropy",
        "value": []
      },
      {
        "name": "MeanKurtosisOfNumericAtts",
        "value": "0.14474553565619397"
      },
      {
        "name": "MeanMeansOfNumericAtts",
        "value": "5.958513887659146"
      },
      {
        "name": "MeanMutualInformation",
        "value": []
      },
      {
        "name": "MeanNoiseToSignalRatio",
        "value": []
      },
      {
        "name": "MeanNominalAttDistinctValues",
        "value": "26.0"
      },
      {
        "name": "MeanSkewnessOfNumericAtts",
        "value": "0.2744381955133375"
      },
      {
        "name": "MeanStdDevOfNumericAtts",
        "value": "2.264075714143632"
      },
      {
        "name": "MinAttributeEntropy",
        "value": []
      },
      {
        "name": "MinKurtosisOfNumericAtts",
        "value": "-0.5808963705075669"
      },
      {
        "name": "MinMeansOfNumericAtts",
        "value": "3.130405014647935"
      },
      {
        "name": "MinMutualInformation",
        "value": []
      },
      {
        "name": "MinNominalAttDistinctValues",
        "value": "26.0"
      },
      {
        "name": "MinSkewnessOfNumericAtts",
        "value": "-0.28830239289052456"
      },
      {
        "name": "MinStdDevOfNumericAtts",
        "value": "1.6202395131704561"
      },
      {
        "name": "MinorityClassPercentage",
        "value": "3.6811000000000003"
      },
      {
        "name": "MinorityClassSize",
        "value": "36811.0"
      },
      {
        "name": "NaiveBayesAUC",
        "value": "0.8569615383313546"
      },
      {
        "name": "NaiveBayesErrRate",
        "value": "0.61858"
      },
      {
        "name": "NaiveBayesKappa",
        "value": "0.3566838309654534"
      },
      {
        "name": "NumberOfBinaryFeatures",
        "value": "0.0"
      },
      {
        "name": "NumberOfClasses",
        "value": "26.0"
      },
      {
        "name": "NumberOfFeatures",
        "value": "17.0"
      },
      {
        "name": "NumberOfInstances",
        "value": "1000000.0"
      },
      {
        "name": "NumberOfInstancesWithMissingValues",
        "value": "0.0"
      },
      {
        "name": "NumberOfMissingValues",
        "value": "0.0"
      },
      {
        "name": "NumberOfNumericFeatures",
        "value": "16.0"
      },
      {
        "name": "NumberOfSymbolicFeatures",
        "value": "1.0"
      },
      {
        "name": "PercentageOfBinaryFeatures",
        "value": "0.0"
      },
      {
        "name": "PercentageOfInstancesWithMissingValues",
        "value": "0.0"
      },
      {
        "name": "PercentageOfMissingValues",
        "value": "0.0"
      },
      {
        "name": "PercentageOfNumericFeatures",
        "value": "94.11764705882352"
      },
      {
        "name": "PercentageOfSymbolicFeatures",
        "value": "5.88235294117647"
      },
      {
        "name": "Quartile1AttributeEntropy",
        "value": []
      },
      {
        "name": "Quartile1KurtosisOfNumericAtts",
        "value": "-0.2940402121665914"
      },
      {
        "name": "Quartile1MeansOfNumericAtts",
        "value": "4.168822316301507"
      },
      {
        "name": "Quartile1MutualInformation",
        "value": []
      },
      {
        "name": "Quartile1SkewnessOfNumericAtts",
        "value": "-0.1120035965950399"
      },
      {
        "name": "Quartile1StdDevOfNumericAtts",
        "value": "1.9998362523658368"
      },
      {
        "name": "Quartile2AttributeEntropy",
        "value": []
      },
      {
        "name": "Quartile2KurtosisOfNumericAtts",
        "value": "0.13825634047878155"
      },
      {
        "name": "Quartile2MeansOfNumericAtts",
        "value": "5.918794576803543"
      },
      {
        "name": "Quartile2MutualInformation",
        "value": []
      },
      {
        "name": "Quartile2SkewnessOfNumericAtts",
        "value": "0.22456254266776504"
      },
      {
        "name": "Quartile2StdDevOfNumericAtts",
        "value": "2.225634401691377"
      },
      {
        "name": "Quartile3AttributeEntropy",
        "value": []
      },
      {
        "name": "Quartile3KurtosisOfNumericAtts",
        "value": "0.48662721335900216"
      },
      {
        "name": "Quartile3MeansOfNumericAtts",
        "value": "7.814618744266033"
      },
      {
        "name": "Quartile3MutualInformation",
        "value": []
      },
      {
        "name": "Quartile3SkewnessOfNumericAtts",
        "value": "0.5999206980593655"
      },
      {
        "name": "Quartile3StdDevOfNumericAtts",
        "value": "2.4789254152693516"
      },
      {
        "name": "REPTreeDepth1AUC",
        "value": "0.8889992571233046"
      },
      {
        "name": "REPTreeDepth1ErrRate",
        "value": "0.407166"
      },
      {
        "name": "REPTreeDepth1Kappa",
        "value": "0.5765270030516034"
      },
      {
        "name": "REPTreeDepth2AUC",
        "value": "0.8889992571233046"
      },
      {
        "name": "REPTreeDepth2ErrRate",
        "value": "0.407166"
      },
      {
        "name": "REPTreeDepth2Kappa",
        "value": "0.5765270030516034"
      },
      {
        "name": "REPTreeDepth3AUC",
        "value": "0.8889992571233046"
      },
      {
        "name": "REPTreeDepth3ErrRate",
        "value": "0.407166"
      },
      {
        "name": "REPTreeDepth3Kappa",
        "value": "0.5765270030516034"
      },
      {
        "name": "RandomTreeDepth1AUC",
        "value": "0.7504582789226527"
      },
      {
        "name": "RandomTreeDepth1ErrRate",
        "value": "0.479906"
      },
      {
        "name": "RandomTreeDepth1Kappa",
        "value": "0.5008840048342589"
      },
      {
        "name": "RandomTreeDepth2AUC",
        "value": "0.7504582789226527"
      },
      {
        "name": "RandomTreeDepth2ErrRate",
        "value": "0.479906"
      },
      {
        "name": "RandomTreeDepth2Kappa",
        "value": "0.5008840048342589"
      },
      {
        "name": "RandomTreeDepth3AUC",
        "value": "0.7504582789226527"
      },
      {
        "name": "RandomTreeDepth3ErrRate",
        "value": "0.479906"
      },
      {
        "name": "RandomTreeDepth3Kappa",
        "value": "0.5008840048342589"
      },
      {
        "name": "StdvNominalAttDistinctValues",
        "value": "0.0"
      },
      {
        "name": "kNN1NAUC",
        "value": "0.7486522001327379"
      },
      {
        "name": "kNN1NErrRate",
        "value": "0.483382"
      },
      {
        "name": "kNN1NKappa",
        "value": "0.49726943498530685"
      }
    ]
  }
}