{
  "data_features": {
    "feature": [
      {
        "data_type": "nominal",
        "index": "0",
        "is_ignore": "false",
        "is_row_identifier": "false",
        "is_target": "false",
        "name": "bkblk",
        "nominal_value": [
          "f",
          "t"
        ],
        "number_of_missing_values": "0"
      },
      {
        "data_type": "nominal",
        "index": "1",
        "is_ignore": "false",
        "is_row_identifier": "false",
        "is_target": "false",
        "name": "bknwy",
        "nominal_value": [
          "f",
          "t"
        ],
        "number_of_missing_values": "0"
      },
      {
        "data_type": "nominal",
        "index": "2",
        "is_ignore": "false",
        "is_row_identifier": "false",
        "is_target": "false",
        "name": "bkon8",
        "nominal_value": [
          "f",
          "t"
        ],
        "number_of_missing_values": "0"
      },
      {
        "data_type": "nominal",
        "index": "3",
        "is_ignore": "false",
        "is_row_identifier": "false",
        "is_target": "false",
        "name": "bkona",
        "nominal_value": [
          "f",
          "t"
        ],
        "number_of_missing_values": "0"
      },
      {
        "data_type": "nominal",
        "index": "4",
        "is_ignore": "false",
        "is_row_identifier": "false",
        "is_target": "false",
        "name": "bkspr",
        "nominal_value": [
          "f",
          "t"
        ],
        "number_of_missing_values": "0"
      },
      {
        "data_type": "nominal",
        "index": "5",
        "is_ignore": "false",
        "is_row_identifier": "false",
        "is_target": "false",
        "name": "bkxbq",
        "nominal_value": [
          "f",
          "t"
        ],
        "number_of_missing_values": "0"
      },
      {
        "data_type": "nominal",
        "index": "6",
        "is_ignore": "false",
        "is_row_identifier": "false",
        "is_target": "false",
        "name": "bkxcr",
        "nominal_value": [
          "f",
          "t"
        ],
        "number_of_missing_values": "0"
      },
      {
        "data_type": "nominal",
        "index": "7",
        "is_ignore": "false",
        "is_row_identifier": "false",
        "is_target": "false",
        "name": "bkxwp",
        "nominal_value": [
          "f",
          "t"
        ],
        "number_of_missing_values": "0"
      },
      {
        "data_type": "nominal",
        "index": "8",
        "is_ignore": "false",
        "is_row_identifier": "false",
        "is_target": "false",
        "name": "blxwp",
        "nominal_value": [
          "f",
          "t"
        ],
        "number_of_missing_values": "0"
      },
      {
        "data_type": "nominal",
        "index": "9",
        "is_ignore": "false",
        "is_row_identifier": "false",
        "is_target": "false",
        "name": "bxqsq",
        "nominal_value": [
          "f",
          "t"
        ],
        "number_of_missing_values": "0"
      },
      {
        "data_type": "nominal",
        "index": "10",
        "is_ignore": "false",
        "is_row_identifier": "false",
        "is_target": "false",
        "name": "cntxt",
        "nominal_value": [
          "f",
          "t"
        ],
        "number_of_missing_values": "0"
      },
      {
        "data_type": "nominal",
        "index": "11",
        "is_ignore": "false",
        "is_row_identifier": "false",
        "is_target": "false",
        "name": "dsopp",
        "nominal_value": [
          "f",
          "t"
        ],
        "number_of_missing_values": "0"
      },
      {
        "data_type": "nominal",
        "index": "12",
        "is_ignore": "false",
        "is_row_identifier": "false",
        "is_target": "false",
        "name": "dwipd",
        "nominal_value": [
          "g",
          "l"
        ],
        "number_of_missing_values": "0"
      },
      {
        "data_type": "nominal",
        "index": "13",
        "is_ignore": "false",
        "is_row_identifier": "false",
        "is_target": "false",
        "name": "hdchk",
        "nominal_value": [
          "f",
          "t"
        ],
        "number_of_missing_values": "0"
      },
      {
        "data_type": "nominal",
        "index": "14",
        "is_ignore": "false",
        "is_row_identifier": "false",
        "is_target": "false",
        "name": "katri",
        "nominal_value": [
          "b",
          "n",
          "w"
        ],
        "number_of_missing_values": "0"
      },
      {
        "data_type": "nominal",
        "index": "15",
        "is_ignore": "false",
        "is_row_identifier": "false",
        "is_target": "false",
        "name": "mulch",
        "nominal_value": [
          "f",
          "t"
        ],
        "number_of_missing_values": "0"
      },
      {
        "data_type": "nominal",
        "index": "16",
        "is_ignore": "false",
        "is_row_identifier": "false",
        "is_target": "false",
        "name": "qxmsq",
        "nominal_value": [
          "f",
          "t"
        ],
        "number_of_missing_values": "0"
      },
      {
        "data_type": "nominal",
        "index": "17",
        "is_ignore": "false",
        "is_row_identifier": "false",
        "is_target": "false",
        "name": "r2ar8",
        "nominal_value": [
          "f",
          "t"
        ],
        "number_of_missing_values": "0"
      },
      {
        "data_type": "nominal",
        "index": "18",
        "is_ignore": "false",
        "is_row_identifier": "false",
        "is_target": "false",
        "name": "reskd",
        "nominal_value": [
          "f",
          "t"
        ],
        "number_of_missing_values": "0"
      },
      {
        "data_type": "nominal",
        "index": "19",
        "is_ignore": "false",
        "is_row_identifier": "false",
        "is_target": "false",
        "name": "reskr",
        "nominal_value": [
          "f",
          "t"
        ],
        "number_of_missing_values": "0"
      },
      {
        "data_type": "nominal",
        "index": "20",
        "is_ignore": "false",
        "is_row_identifier": "false",
        "is_target": "false",
        "name": "rimmx",
        "nominal_value": [
          "f",
          "t"
        ],
        "number_of_missing_values": "0"
      },
      {
        "data_type": "nominal",
        "index": "21",
        "is_ignore": "false",
        "is_row_identifier": "false",
        "is_target": "false",
        "name": "rkxwp",
        "nominal_value": [
          "f",
          "t"
        ],
        "number_of_missing_values": "0"
      },
      {
        "data_type": "nominal",
        "index": "22",
        "is_ignore": "false",
        "is_row_identifier": "false",
        "is_target": "false",
        "name": "rxmsq",
        "nominal_value": [
          "f",
          "t"
        ],
        "number_of_missing_values": "0"
      },
      {
        "data_type": "nominal",
        "index": "23",
        "is_ignore": "false",
        "is_row_identifier": "false",
        "is_target": "false",
        "name": "simpl",
        "nominal_value": [
          "f",
          "t"
        ],
        "number_of_missing_values": "0"
      },
      {
        "data_type": "nominal",
        "index": "24",
        "is_ignore": "false",
        "is_row_identifier": "false",
        "is_target": "false",
        "name": "skach",
        "nominal_value": [
          "f",
          "t"
        ],
        "number_of_missing_values": "0"
      },
      {
        "data_type": "nominal",
        "index": "25",
        "is_ignore": "false",
        "is_row_identifier": "false",
        "is_target": "false",
        "name": "skewr",
        "nominal_value": [
          "f",
          "t"
        ],
        "number_of_missing_values": "0"
      },
      {
        "data_type": "nominal",
        "index": "26",
        "is_ignore": "false",
        "is_row_identifier": "false",
        "is_target": "false",
        "name": "skrxp",
        "nominal_value": [
          "f",
          "t"
        ],
        "number_of_missing_values": "0"
      },
      {
        "data_type": "nominal",
        "index": "27",
        "is_ignore": "false",
        "is_row_identifier": "false",
        "is_target": "false",
        "name": "spcop",
        "nominal_value": [
          "f",
          "t"
        ],
        "number_of_missing_values": "0"
      },
      {
        "data_type": "nominal",
        "index": "28",
        "is_ignore": "false",
        "is_row_identifier": "false",
        "is_target": "false",
        "name": "stlmt",
        "nominal_value": [
          "f",
          "t"
        ],
        "number_of_missing_values": "0"
      },
      {
        "data_type": "nominal",
        "index": "29",
        "is_ignore": "false",
        "is_row_identifier": "false",
        "is_target": "false",
        "name": "thrsk",
        "nominal_value": [
          "f",
          "t"
        ],
        "number_of_missing_values": "0"
      },
      {
        "data_type": "nominal",
        "index": "30",
        "is_ignore": "false",
        "is_row_identifier": "false",
        "is_target": "false",
        "name": "wkcti",
        "nominal_value": [
          "f",
          "t"
        ],
        "number_of_missing_values": "0"
      },
      {
        "data_type": "nominal",
        "index": "31",
        "is_ignore": "false",
        "is_row_identifier": "false",
        "is_target": "false",
        "name": "wkna8",
        "nominal_value": [
          "f",
          "t"
        ],
        "number_of_missing_values": "0"
      },
      {
        "data_type": "nominal",
        "index": "32",
        "is_ignore": "false",
        "is_row_identifier": "false",
        "is_target": "false",
        "name": "wknck",
        "nominal_value": [
          "f",
          "t"
        ],
        "number_of_missing_values": "0"
      },
      {
        "data_type": "nominal",
        "index": "33",
        "is_ignore": "false",
        "is_row_identifier": "false",
        "is_target": "false",
        "name": "wkovl",
        "nominal_value": [
          "f",
          "t"
        ],
        "number_of_missing_values": "0"
      },
      {
        "data_type": "nominal",
        "index": "34",
        "is_ignore": "false",
        "is_row_identifier": "false",
        "is_target": "false",
        "name": "wkpos",
        "nominal_value": [
          "f",
          "t"
        ],
        "number_of_missing_values": "0"
      },
      {
        "data_type": "nominal",
        "index": "35",
        "is_ignore": "false",
        "is_row_identifier": "false",
        "is_target": "false",
        "name": "wtoeg",
        "nominal_value": [
          "f",
          "n",
          "t"
        ],
        "number_of_missing_values": "0"
      },
      {
        "data_type": "nominal",
        "index": "36",
        "is_ignore": "false",
        "is_row_identifier": "false",
        "is_target": "true",
        "name": "class",
        "nominal_value": [
          "nowin",
          "won"
        ],
        "number_of_missing_values": "0"
      }
    ]
  }
}