{
  "data_features": {
    "feature": [
      {
        "data_type": "nominal",
        "index": "0",
        "is_ignore": "false",
        "is_row_identifier": "false",
        "is_target": "false",
        "name": "family",
        "nominal_value": [
          "GB",
          "GK",
          "GS",
          "TN",
          "ZA",
          "ZF",
          "ZH",
          "ZM",
          "ZS"
        ],
        "number_of_missing_values": "0"
      },
      {
        "data_type": "nominal",
        "index": "1",
        "is_ignore": "false",
        "is_row_identifier": "false",
        "is_target": "false",
        "name": "product-type",
        "nominal_value": [
          "C",
          "G",
          "H"
        ],
        "number_of_missing_values": "0"
      },
      {
        "data_type": "nominal",
        "index": "2",
        "is_ignore": "false",
        "is_row_identifier": "false",
        "is_target": "false",
        "name": "steel",
        "nominal_value": [
          "A",
          "K",
          "M",
          "R",
          "S",
          "U",
          "V",
          "W"
        ],
        "number_of_missing_values": "0"
      },
      {
        "data_type": "numeric",
        "index": "3",
        "is_ignore": "false",
        "is_row_identifier": "false",
        "is_target": "false",
        "name": "carbon",
        "number_of_missing_values": "0"
      },
      {
        "data_type": "numeric",
        "index": "4",
        "is_ignore": "false",
        "is_row_identifier": "false",
        "is_target": "false",
        "name": "hardness",
        "number_of_missing_values": "0"
      },
      {
        "data_type": "nominal",
        "index": "5",
        "is_ignore": "false",
        "is_row_identifier": "false",
        "is_target": "false",
        "name": "temper_rolling",
        "nominal_value": "T",
        "number_of_missing_values": "0"
      },
      {
        "data_type": "nominal",
        "index": "6",
        "is_ignore": "false",
        "is_row_identifier": "false",
        "is_target": "false",
        "name": "condition",
        "nominal_value": [
          "A",
          "S",
          "X"
        ],
        "number_of_missing_values": "0"
      },
      {
        "data_type": "nominal",
        "index": "7",
        "is_ignore": "false",
        "is_row_identifier": "false",
        "is_target": "false",
        "name": "formability",
        "nominal_value": [
          "1",
          "2",
          "3",
          "4",
          "5"
        ],
        "number_of_missing_values": "0"
      },
      {
        "data_type": "numeric",
        "index": "8",
        "is_ignore": "false",
        "is_row_identifier": "false",
        "is_target": "false",
        "name": "strength",
        "number_of_missing_values": "0"
      },
      {
        "data_type": "nominal",
        "index": "9",
        "is_ignore": "false",
        "is_row_identifier": "false",
        "is_target": "false",
        "name": "non-ageing",
        "nominal_value": "N",
        "number_of_missing_values": "0"
      },
      {
        "data_type": "nominal",
        "index": "10",
        "is_ignore": "false",
        "is_row_identifier": "false",
        "is_target": "false",
        "name": "surface-finish",
        "nominal_value": [
          "M",
          "P"
        ],
        "number_of_missing_values": "0"
      },
      {
        "data_type": "nominal",
        "index": "11",
        "is_ignore": "false",
        "is_row_identifier": "false",
        "is_target": "false",
        "name": "surface-quality",
        "nominal_value": [
          "D",
          "E",
          "F",
          "G"
        ],
        "number_of_missing_values": "0"
      },
      {
        "data_type": "nominal",
        "index": "12",
        "is_ignore": "false",
        "is_row_identifier": "false",
        "is_target": "false",
        "name": "enamelability",
        "nominal_value": [
          "1",
          "2",
          "3",
          "4",
          "5"
        ],
        "number_of_missing_values": "0"
      },
      {
        "data_type": "nominal",
        "index": "13",
        "is_ignore": "false",
        "is_row_identifier": "false",
        "is_target": "false",
        "name": "bc",
        "nominal_value": "Y",
        "number_of_missing_values": "0"
      },
      {
        "data_type": "nominal",
        "index": "14",
        "is_ignore": "false",
        "is_row_identifier": "false",
        "is_target": "false",
        "name": "bf",
        "nominal_value": "Y",
        "number_of_missing_values": "0"
      },
      {
        "data_type": "nominal",
        "index": "15",
        "is_ignore": "false",
        "is_row_identifier": "false",
        "is_target": "false",
        "name": "bt",
        "nominal_value": "Y",
        "number_of_missing_values": "0"
      },
      {
        "data_type": "nominal",
        "index": "16",
        "is_ignore": "false",
        "is_row_identifier": "false",
        "is_target": "false",
        "name": "bw%2Fme",
        "nominal_value": [
          "B",
          "M"
        ],
        "number_of_missing_values": "0"
      },
      {
        "data_type": "nominal",
        "index": "17",
        "is_ignore": "false",
        "is_row_identifier": "false",
        "is_target": "false",
        "name": "bl",
        "nominal_value": "Y",
        "number_of_missing_values": "0"
      },
      {
        "data_type": "nominal",
        "index": "18",
        "is_ignore": "false",
        "is_row_identifier": "false",
        "is_target": "false",
        "name": "m",
        "nominal_value": "Y",
        "number_of_missing_values": "0"
      },
      {
        "data_type": "nominal",
        "index": "19",
        "is_ignore": "false",
        "is_row_identifier": "false",
        "is_target": "false",
        "name": "chrom",
        "nominal_value": "C",
        "number_of_missing_values": "0"
      },
      {
        "data_type": "nominal",
        "index": "20",
        "is_ignore": "false",
        "is_row_identifier": "false",
        "is_target": "false",
        "name": "phos",
        "nominal_value": "P",
        "number_of_missing_values": "0"
      },
      {
        "data_type": "nominal",
        "index": "21",
        "is_ignore": "false",
        "is_row_identifier": "false",
        "is_target": "false",
        "name": "cbond",
        "nominal_value": "Y",
        "number_of_missing_values": "0"
      },
      {
        "data_type": "nominal",
        "index": "22",
        "is_ignore": "false",
        "is_row_identifier": "false",
        "is_target": "false",
        "name": "marvi",
        "nominal_value": "Y",
        "number_of_missing_values": "0"
      },
      {
        "data_type": "nominal",
        "index": "23",
        "is_ignore": "false",
        "is_row_identifier": "false",
        "is_target": "false",
        "name": "exptl",
        "nominal_value": "Y",
        "number_of_missing_values": "0"
      },
      {
        "data_type": "nominal",
        "index": "24",
        "is_ignore": "false",
        "is_row_identifier": "false",
        "is_target": "false",
        "name": "ferro",
        "nominal_value": "Y",
        "number_of_missing_values": "0"
      },
      {
        "data_type": "nominal",
        "index": "25",
        "is_ignore": "false",
        "is_row_identifier": "false",
        "is_target": "false",
        "name": "corr",
        "nominal_value": "Y",
        "number_of_missing_values": "0"
      },
      {
        "data_type": "nominal",
        "index": "26",
        "is_ignore": "false",
        "is_row_identifier": "false",
        "is_target": "false",
        "name": "blue%2Fbright%2Fvarn%2Fclean",
        "nominal_value": [
          "B",
          "C",
          "R",
          "V"
        ],
        "number_of_missing_values": "0"
      },
      {
        "data_type": "nominal",
        "index": "27",
        "is_ignore": "false",
        "is_row_identifier": "false",
        "is_target": "false",
        "name": "lustre",
        "nominal_value": "Y",
        "number_of_missing_values": "0"
      },
      {
        "data_type": "nominal",
        "index": "28",
        "is_ignore": "false",
        "is_row_identifier": "false",
        "is_target": "false",
        "name": "jurofm",
        "nominal_value": "Y",
        "number_of_missing_values": "0"
      },
      {
        "data_type": "nominal",
        "index": "29",
        "is_ignore": "false",
        "is_row_identifier": "false",
        "is_target": "false",
        "name": "s",
        "nominal_value": "Y",
        "number_of_missing_values": "0"
      },
      {
        "data_type": "nominal",
        "index": "30",
        "is_ignore": "false",
        "is_row_identifier": "false",
        "is_target": "false",
        "name": "p",
        "nominal_value": "Y",
        "number_of_missing_values": "0"
      },
      {
        "data_type": "nominal",
        "index": "31",
        "is_ignore": "false",
        "is_row_identifier": "false",
        "is_target": "false",
        "name": "shape",
        "nominal_value": [
          "COIL",
          "SHEET"
        ],
        "number_of_missing_values": "0"
      },
      {
        "data_type": "numeric",
        "index": "32",
        "is_ignore": "false",
        "is_row_identifier": "false",
        "is_target": "false",
        "name": "thick",
        "number_of_missing_values": "0"
      },
      {
        "data_type": "numeric",
        "index": "33",
        "is_ignore": "false",
        "is_row_identifier": "false",
        "is_target": "false",
        "name": "width",
        "number_of_missing_values": "0"
      },
      {
        "data_type": "numeric",
        "index": "34",
        "is_ignore": "false",
        "is_row_identifier": "false",
        "is_target": "false",
        "name": "len",
        "number_of_missing_values": "0"
      },
      {
        "data_type": "nominal",
        "index": "35",
        "is_ignore": "false",
        "is_row_identifier": "false",
        "is_target": "false",
        "name": "oil",
        "nominal_value": [
          "N",
          "Y"
        ],
        "number_of_missing_values": "0"
      },
      {
        "data_type": "nominal",
        "index": "36",
        "is_ignore": "false",
        "is_row_identifier": "false",
        "is_target": "false",
        "name": "bore",
        "nominal_value": [
          "0",
          "500",
          "600",
          "760"
        ],
        "number_of_missing_values": "0"
      },
      {
        "data_type": "nominal",
        "index": "37",
        "is_ignore": "false",
        "is_row_identifier": "false",
        "is_target": "false",
        "name": "packing",
        "nominal_value": [
          "1",
          "2",
          "3"
        ],
        "number_of_missing_values": "0"
      },
      {
        "data_type": "nominal",
        "index": "38",
        "is_ignore": "false",
        "is_row_identifier": "false",
        "is_target": "true",
        "name": "class",
        "nominal_value": [
          "1",
          "2",
          "3",
          "4",
          "5",
          "U"
        ],
        "number_of_missing_values": "0"
      }
    ]
  }
}