{
  "data_set_description": {
    "collection_date": "2015-02-23 10:28:24",
    "creator": [
      "Geoffrey Holmes",
      "Bernhard Pfahringer",
      "Jan van Rijn",
      "Joaquin Vanschoren"
    ],
    "default_target_attribute": "class",
    "description": [],
    "description_version": "1",
    "file_id": "582930",
    "format": "ARFF",
    "id": "1351",
    "licence": "public domain",
    "md5_checksum": "f7376c6127344e1d49dbfa1217dabb58",
    "minio_url": "https://data.openml.org/datasets/0000/1351/dataset_1351.pq",
    "name": "BNG(anneal,1000,1)",
    "parquet_url": "https://data.openml.org/datasets/0000/1351/dataset_1351.pq",
    "processing_date": "2018-10-03 21:31:32",
    "status": "active",
    "tag": [
      "artificial",
      "BNG",
      "Engineering",
      "Manufacturing",
      "Materials Science"
    ],
    "upload_date": "2015-02-22T22:29:46",
    "url": "https://api.openml.org/data/v1/download/582930/BNG(anneal,1000,1).arff",
    "version": "1",
    "visibility": "public"
  }
}