{
  "data_set_description": {
    "collection_date": "2014-04-08 23:29:40",
    "creator": [
      "Geoffrey Holmes",
      "Bernhard Pfahringer",
      "Jan van Rijn",
      "Joaquin Vanschoren"
    ],
    "default_target_attribute": "Class",
    "description": [],
    "description_version": "1",
    "file_id": "1855",
    "format": "ARFF",
    "id": "131",
    "licence": "Public",
    "md5_checksum": "dec25ca35750a6a160831bf8158f081b",
    "minio_url": "https://data.openml.org/datasets/0000/0131/dataset_131.pq",
    "name": "BNG(sick,nominal,1000000)",
    "parquet_url": "https://data.openml.org/datasets/0000/0131/dataset_131.pq",
    "processing_date": "2020-11-20 19:21:41",
    "status": "active",
    "tag": [
      "artificial",
      "BNG",
      "Health",
      "Medicine",
      "study_69"
    ],
    "upload_date": "2014-04-08T13:28:15",
    "url": "https://api.openml.org/data/v1/download/1855/BNG(sick,nominal,1000000).arff",
    "version": "1",
    "version_label": "1",
    "visibility": "public"
  }
}