{
  "data_features": {
    "feature": [
      {
        "data_type": "nominal",
        "index": "0",
        "is_ignore": "false",
        "is_row_identifier": "false",
        "is_target": "false",
        "name": "checking_status",
        "nominal_value": [
          "0<=X<200",
          "<0",
          ">=200",
          "no checking"
        ],
        "number_of_missing_values": "0"
      },
      {
        "data_type": "nominal",
        "index": "1",
        "is_ignore": "false",
        "is_row_identifier": "false",
        "is_target": "false",
        "name": "duration",
        "nominal_value": [
          "'B1of3'",
          "'B2of3'",
          "'B3of3'"
        ],
        "number_of_missing_values": "0"
      },
      {
        "data_type": "nominal",
        "index": "2",
        "is_ignore": "false",
        "is_row_identifier": "false",
        "is_target": "false",
        "name": "credit_history",
        "nominal_value": [
          "all paid",
          "critical/other existing credit",
          "delayed previously",
          "existing paid",
          "no credits/all paid"
        ],
        "number_of_missing_values": "0"
      },
      {
        "data_type": "nominal",
        "index": "3",
        "is_ignore": "false",
        "is_row_identifier": "false",
        "is_target": "false",
        "name": "purpose",
        "nominal_value": [
          "business",
          "domestic appliance",
          "education",
          "furniture/equipment",
          "new car",
          "other",
          "radio/tv",
          "repairs",
          "retraining",
          "used car",
          "vacation"
        ],
        "number_of_missing_values": "0"
      },
      {
        "data_type": "nominal",
        "index": "4",
        "is_ignore": "false",
        "is_row_identifier": "false",
        "is_target": "false",
        "name": "credit_amount",
        "nominal_value": [
          "'B1of3'",
          "'B2of3'",
          "'B3of3'"
        ],
        "number_of_missing_values": "0"
      },
      {
        "data_type": "nominal",
        "index": "5",
        "is_ignore": "false",
        "is_row_identifier": "false",
        "is_target": "false",
        "name": "savings_status",
        "nominal_value": [
          "100<=X<500",
          "500<=X<1000",
          "<100",
          ">=1000",
          "no known savings"
        ],
        "number_of_missing_values": "0"
      },
      {
        "data_type": "nominal",
        "index": "6",
        "is_ignore": "false",
        "is_row_identifier": "false",
        "is_target": "false",
        "name": "employment",
        "nominal_value": [
          "1<=X<4",
          "4<=X<7",
          "<1",
          ">=7",
          "unemployed"
        ],
        "number_of_missing_values": "0"
      },
      {
        "data_type": "nominal",
        "index": "7",
        "is_ignore": "false",
        "is_row_identifier": "false",
        "is_target": "false",
        "name": "installment_commitment",
        "nominal_value": [
          "'B1of3'",
          "'B2of3'",
          "'B3of3'"
        ],
        "number_of_missing_values": "0"
      },
      {
        "data_type": "nominal",
        "index": "8",
        "is_ignore": "false",
        "is_row_identifier": "false",
        "is_target": "false",
        "name": "personal_status",
        "nominal_value": [
          "female div/dep/mar",
          "female single",
          "male div/sep",
          "male mar/wid",
          "male single"
        ],
        "number_of_missing_values": "0"
      },
      {
        "data_type": "nominal",
        "index": "9",
        "is_ignore": "false",
        "is_row_identifier": "false",
        "is_target": "false",
        "name": "other_parties",
        "nominal_value": [
          "co applicant",
          "guarantor",
          "none"
        ],
        "number_of_missing_values": "0"
      },
      {
        "data_type": "nominal",
        "index": "10",
        "is_ignore": "false",
        "is_row_identifier": "false",
        "is_target": "false",
        "name": "residence_since",
        "nominal_value": [
          "'B1of3'",
          "'B2of3'",
          "'B3of3'"
        ],
        "number_of_missing_values": "0"
      },
      {
        "data_type": "nominal",
        "index": "11",
        "is_ignore": "false",
        "is_row_identifier": "false",
        "is_target": "false",
        "name": "property_magnitude",
        "nominal_value": [
          "car",
          "life insurance",
          "no known property",
          "real estate"
        ],
        "number_of_missing_values": "0"
      },
      {
        "data_type": "nominal",
        "index": "12",
        "is_ignore": "false",
        "is_row_identifier": "false",
        "is_target": "false",
        "name": "age",
        "nominal_value": [
          "'B1of3'",
          "'B2of3'",
          "'B3of3'"
        ],
        "number_of_missing_values": "0"
      },
      {
        "data_type": "nominal",
        "index": "13",
        "is_ignore": "false",
        "is_row_identifier": "false",
        "is_target": "false",
        "name": "other_payment_plans",
        "nominal_value": [
          "bank",
          "none",
          "stores"
        ],
        "number_of_missing_values": "0"
      },
      {
        "data_type": "nominal",
        "index": "14",
        "is_ignore": "false",
        "is_row_identifier": "false",
        "is_target": "false",
        "name": "housing",
        "nominal_value": [
          "for free",
          "own",
          "rent"
        ],
        "number_of_missing_values": "0"
      },
      {
        "data_type": "nominal",
        "index": "15",
        "is_ignore": "false",
        "is_row_identifier": "false",
        "is_target": "false",
        "name": "existing_credits",
        "nominal_value": [
          "'B1of3'",
          "'B2of3'",
          "'B3of3'"
        ],
        "number_of_missing_values": "0"
      },
      {
        "data_type": "nominal",
        "index": "16",
        "is_ignore": "false",
        "is_row_identifier": "false",
        "is_target": "false",
        "name": "job",
        "nominal_value": [
          "high qualif/self emp/mgmt",
          "skilled",
          "unemp/unskilled non res",
          "unskilled resident"
        ],
        "number_of_missing_values": "0"
      },
      {
        "data_type": "nominal",
        "index": "17",
        "is_ignore": "false",
        "is_row_identifier": "false",
        "is_target": "false",
        "name": "num_dependents",
        "nominal_value": [
          "'B1of3'",
          "'B2of3'",
          "'B3of3'"
        ],
        "number_of_missing_values": "0"
      },
      {
        "data_type": "nominal",
        "index": "18",
        "is_ignore": "false",
        "is_row_identifier": "false",
        "is_target": "false",
        "name": "own_telephone",
        "nominal_value": [
          "none",
          "yes"
        ],
        "number_of_missing_values": "0"
      },
      {
        "data_type": "nominal",
        "index": "19",
        "is_ignore": "false",
        "is_row_identifier": "false",
        "is_target": "false",
        "name": "foreign_worker",
        "nominal_value": [
          "no",
          "yes"
        ],
        "number_of_missing_values": "0"
      },
      {
        "data_type": "nominal",
        "index": "20",
        "is_ignore": "false",
        "is_row_identifier": "false",
        "is_target": "true",
        "name": "class",
        "nominal_value": [
          "bad",
          "good"
        ],
        "number_of_missing_values": "0"
      }
    ]
  }
}