{
  "data_set_description": {
    "collection_date": "2014-11-12 14:22:12",
    "contributor": [
      [],
      []
    ],
    "creator": [
      "Geoffrey Holmes",
      "Bernhard Pfahringer",
      "Jan van Rijn",
      "Joaquin Vanschoren"
    ],
    "default_target_attribute": "thetadd6",
    "description": [],
    "description_version": "1",
    "file_id": "150784",
    "format": "ARFF",
    "id": "1210",
    "licence": "public domain",
    "md5_checksum": "c0d38e33dad999534d8c1d217fa8b0c9",
    "minio_url": "https://data.openml.org/datasets/0000/1210/dataset_1210.pq",
    "name": "BNG(puma32H)",
    "parquet_url": "https://data.openml.org/datasets/0000/1210/dataset_1210.pq",
    "processing_date": "2020-11-20 21:21:00",
    "status": "active",
    "tag": [
      "artificial",
      "BNG",
      "Engineering",
      "Technology"
    ],
    "upload_date": "2014-11-12T14:22:33",
    "url": "https://api.openml.org/data/v1/download/150784/BNG(puma32H).arff",
    "version": "1",
    "visibility": "public"
  }
}