{
  "data_set_description": {
    "collection_date": "2014-11-12 12:24:58",
    "creator": [
      "Geoffrey Holmes",
      "Bernhard Pfahringer",
      "Jan van Rijn",
      "Joaquin Vanschoren"
    ],
    "default_target_attribute": "usr",
    "description": [],
    "description_version": "1",
    "file_id": "150696",
    "format": "ARFF",
    "id": "1202",
    "licence": "public domain",
    "md5_checksum": "2facb2a035da92f5b0e31d8491e00a1d",
    "minio_url": "https://data.openml.org/datasets/0000/1202/dataset_1202.pq",
    "name": "BNG(cpu_small)",
    "parquet_url": "https://data.openml.org/datasets/0000/1202/dataset_1202.pq",
    "processing_date": "2018-10-03 21:27:19",
    "status": "active",
    "tag": [
      "artificial",
      "Biology",
      "BNG"
    ],
    "upload_date": "2014-11-12T12:25:04",
    "url": "https://api.openml.org/data/v1/download/150696/BNG(cpu_small).arff",
    "version": "1",
    "visibility": "public"
  }
}