{
  "data_features": {
    "feature": [
      {
        "data_type": "nominal",
        "index": "0",
        "is_ignore": "false",
        "is_row_identifier": "false",
        "is_target": "false",
        "name": "Inst",
        "nominal_value": [
          "1",
          "2",
          "3",
          "4",
          "5",
          "6"
        ],
        "number_of_missing_values": "0"
      },
      {
        "data_type": "nominal",
        "index": "1",
        "is_ignore": "false",
        "is_row_identifier": "false",
        "is_target": "false",
        "name": "sex",
        "nominal_value": [
          "1",
          "2"
        ],
        "number_of_missing_values": "0"
      },
      {
        "data_type": "nominal",
        "index": "2",
        "is_ignore": "false",
        "is_row_identifier": "false",
        "is_target": "false",
        "name": "Treatment",
        "nominal_value": [
          "1",
          "2"
        ],
        "number_of_missing_values": "0"
      },
      {
        "data_type": "nominal",
        "index": "3",
        "is_ignore": "false",
        "is_row_identifier": "false",
        "is_target": "false",
        "name": "Grade",
        "nominal_value": [
          "1",
          "2",
          "3"
        ],
        "number_of_missing_values": "0"
      },
      {
        "data_type": "numeric",
        "index": "4",
        "is_ignore": "false",
        "is_row_identifier": "false",
        "is_target": "false",
        "name": "Age",
        "number_of_missing_values": "0"
      },
      {
        "data_type": "nominal",
        "index": "5",
        "is_ignore": "false",
        "is_row_identifier": "false",
        "is_target": "false",
        "name": "Condition",
        "nominal_value": [
          "0",
          "1",
          "2",
          "3",
          "4"
        ],
        "number_of_missing_values": "0"
      },
      {
        "data_type": "nominal",
        "index": "6",
        "is_ignore": "false",
        "is_row_identifier": "false",
        "is_target": "false",
        "name": "Site",
        "nominal_value": [
          "1",
          "2",
          "4"
        ],
        "number_of_missing_values": "0"
      },
      {
        "data_type": "nominal",
        "index": "7",
        "is_ignore": "false",
        "is_row_identifier": "false",
        "is_target": "false",
        "name": "T",
        "nominal_value": [
          "1",
          "2",
          "3",
          "4"
        ],
        "number_of_missing_values": "0"
      },
      {
        "data_type": "nominal",
        "index": "8",
        "is_ignore": "false",
        "is_row_identifier": "false",
        "is_target": "false",
        "name": "N",
        "nominal_value": [
          "0",
          "1",
          "2",
          "3"
        ],
        "number_of_missing_values": "0"
      },
      {
        "data_type": "nominal",
        "index": "9",
        "is_ignore": "true",
        "is_row_identifier": "false",
        "is_target": "false",
        "name": "Entry",
        "nominal_value": [
          "10571",
          "10668",
          "10768",
          "11070",
          "11371",
          "11869",
          "11870",
          "12068",
          "12371",
          "12470",
          "12569",
          "1271",
          "1272",
          "12769",
          "12969",
          "13170",
          "13269",
          "13368",
          "13569",
          "13671",
          "14369",
          "14372",
          "14470",
          "14670",
          "15270",
          "15371",
          "15468",
          "15471",
          "15569",
          "15669",
          "15672",
          "1571",
          "15772",
          "15870",
          "15971",
          "16070",
          "16171",
          "16669",
          "16670",
          "16769",
          "17470",
          "1769",
          "17869",
          "18268",
          "18371",
          "18468",
          "1871",
          "18770",
          "18871",
          "18970",
          "19068",
          "19070",
          "19969",
          "20171",
          "20271",
          "20469",
          "20570",
          "20572",
          "20768",
          "20772",
          "20971",
          "20972",
          "21170",
          "21671",
          "21768",
          "21871",
          "21970",
          "22171",
          "2271",
          "22768",
          "22772",
          "23069",
          "23170",
          "23368",
          "23771",
          "24370",
          "24372",
          "24569",
          "2468",
          "2469",
          "24872",
          "25170",
          "25371",
          "25470",
          "25870",
          "25968",
          "26371",
          "26669",
          "2671",
          "26869",
          "27371",
          "27672",
          "2769",
          "27969",
          "28068",
          "28069",
          "28071",
          "28268",
          "28471",
          "28570",
          "28770",
          "28968",
          "28969",
          "29069",
          "29468",
          "29471",
          "2968",
          "29868",
          "29971",
          "30468",
          "30469",
          "30868",
          "31068",
          "31471",
          "31670",
          "31868",
          "31971",
          "32171",
          "32371",
          "32468",
          "32671",
          "32770",
          "32869",
          "33069",
          "33071",
          "33269",
          "33368",
          "33370",
          "33568",
          "33569",
          "33669",
          "33670",
          "3368",
          "3371",
          "33868",
          "34071",
          "34170",
          "34270",
          "34271",
          "34370",
          "34469",
          "34470",
          "34771",
          "35369",
          "35570",
          "3569",
          "3572",
          "36270",
          "36369",
          "369",
          "4270",
          "4371",
          "4469",
          "4470",
          "4569",
          "4672",
          "4870",
          "4969",
          "4970",
          "4971",
          "5169",
          "5470",
          "5472",
          "5572",
          "5669",
          "5672",
          "5768",
          "5770",
          "5972",
          "6771",
          "7571",
          "769",
          "7771",
          "7870",
          "8072",
          "8270",
          "8272",
          "8369",
          "870",
          "8871",
          "9369",
          "9568",
          "9670",
          "969"
        ],
        "number_of_missing_values": "0"
      },
      {
        "data_type": "nominal",
        "index": "10",
        "is_ignore": "false",
        "is_row_identifier": "false",
        "is_target": "false",
        "name": "Status",
        "nominal_value": [
          "0",
          "1"
        ],
        "number_of_missing_values": "0"
      },
      {
        "data_type": "numeric",
        "index": "11",
        "is_ignore": "false",
        "is_row_identifier": "false",
        "is_target": "true",
        "name": "class",
        "number_of_missing_values": "0"
      }
    ]
  }
}