{
  "data_qualities": {
    "quality": [
      {
        "name": "AutoCorrelation",
        "value": "0.3503390903336649"
      },
      {
        "name": "CfsSubsetEval_DecisionStumpAUC",
        "value": "0.6898190911198034"
      },
      {
        "name": "CfsSubsetEval_DecisionStumpErrRate",
        "value": "0.48043258101851855"
      },
      {
        "name": "CfsSubsetEval_DecisionStumpKappa",
        "value": "0.25256521700299583"
      },
      {
        "name": "CfsSubsetEval_NaiveBayesAUC",
        "value": "0.6898190911198034"
      },
      {
        "name": "CfsSubsetEval_NaiveBayesErrRate",
        "value": "0.48043258101851855"
      },
      {
        "name": "CfsSubsetEval_NaiveBayesKappa",
        "value": "0.25256521700299583"
      },
      {
        "name": "CfsSubsetEval_kNN1NAUC",
        "value": "0.6898190911198034"
      },
      {
        "name": "CfsSubsetEval_kNN1NErrRate",
        "value": "0.48043258101851855"
      },
      {
        "name": "CfsSubsetEval_kNN1NKappa",
        "value": "0.25256521700299583"
      },
      {
        "name": "ClassEntropy",
        "value": "1.5394000467227373"
      },
      {
        "name": "DecisionStumpAUC",
        "value": "0.5764391530079019"
      },
      {
        "name": "DecisionStumpErrRate",
        "value": "0.5511248553240741"
      },
      {
        "name": "DecisionStumpKappa",
        "value": "0.1526033249406976"
      },
      {
        "name": "Dimensionality",
        "value": "1.808449074074074E-4"
      },
      {
        "name": "EquivalentNumberOfAtts",
        "value": "57.55904684615221"
      },
      {
        "name": "J48.00001.AUC",
        "value": "0.6882219419658143"
      },
      {
        "name": "J48.00001.ErrRate",
        "value": "0.48119212962962965"
      },
      {
        "name": "J48.00001.Kappa",
        "value": "0.24931959988931146"
      },
      {
        "name": "J48.0001.AUC",
        "value": "0.6882219419658143"
      },
      {
        "name": "J48.0001.ErrRate",
        "value": "0.48119212962962965"
      },
      {
        "name": "J48.0001.Kappa",
        "value": "0.24931959988931146"
      },
      {
        "name": "J48.001.AUC",
        "value": "0.6882219419658143"
      },
      {
        "name": "J48.001.ErrRate",
        "value": "0.48119212962962965"
      },
      {
        "name": "J48.001.Kappa",
        "value": "0.24931959988931146"
      },
      {
        "name": "MajorityClassPercentage",
        "value": "42.77886284722222"
      },
      {
        "name": "MajorityClassSize",
        "value": "23655.0"
      },
      {
        "name": "MaxAttributeEntropy",
        "value": "1.867726040695708"
      },
      {
        "name": "MaxKurtosisOfNumericAtts",
        "value": []
      },
      {
        "name": "MaxMeansOfNumericAtts",
        "value": []
      },
      {
        "name": "MaxMutualInformation",
        "value": "0.06753513876466"
      },
      {
        "name": "MaxNominalAttDistinctValues",
        "value": "4.0"
      },
      {
        "name": "MaxSkewnessOfNumericAtts",
        "value": []
      },
      {
        "name": "MaxStdDevOfNumericAtts",
        "value": []
      },
      {
        "name": "MeanAttributeEntropy",
        "value": "1.2068220896716657"
      },
      {
        "name": "MeanKurtosisOfNumericAtts",
        "value": []
      },
      {
        "name": "MeanMeansOfNumericAtts",
        "value": []
      },
      {
        "name": "MeanMutualInformation",
        "value": "0.02674471053763889"
      },
      {
        "name": "MeanNoiseToSignalRatio",
        "value": "44.12376710801402"
      },
      {
        "name": "MeanNominalAttDistinctValues",
        "value": "3.1"
      },
      {
        "name": "MeanSkewnessOfNumericAtts",
        "value": []
      },
      {
        "name": "MeanStdDevOfNumericAtts",
        "value": []
      },
      {
        "name": "MinAttributeEntropy",
        "value": "0.39778758376769097"
      },
      {
        "name": "MinKurtosisOfNumericAtts",
        "value": []
      },
      {
        "name": "MinMeansOfNumericAtts",
        "value": []
      },
      {
        "name": "MinMutualInformation",
        "value": "0.00222816864283"
      },
      {
        "name": "MinNominalAttDistinctValues",
        "value": "2.0"
      },
      {
        "name": "MinSkewnessOfNumericAtts",
        "value": []
      },
      {
        "name": "MinStdDevOfNumericAtts",
        "value": []
      },
      {
        "name": "MinorityClassPercentage",
        "value": "22.705078125"
      },
      {
        "name": "MinorityClassSize",
        "value": "12555.0"
      },
      {
        "name": "NaiveBayesAUC",
        "value": "0.6730206292394812"
      },
      {
        "name": "NaiveBayesErrRate",
        "value": "0.5124963831018519"
      },
      {
        "name": "NaiveBayesKappa",
        "value": "0.22282428715465166"
      },
      {
        "name": "NumberOfBinaryFeatures",
        "value": "3.0"
      },
      {
        "name": "NumberOfClasses",
        "value": "3.0"
      },
      {
        "name": "NumberOfFeatures",
        "value": "10.0"
      },
      {
        "name": "NumberOfInstances",
        "value": "55296.0"
      },
      {
        "name": "NumberOfInstancesWithMissingValues",
        "value": "0.0"
      },
      {
        "name": "NumberOfMissingValues",
        "value": "0.0"
      },
      {
        "name": "NumberOfNumericFeatures",
        "value": "0.0"
      },
      {
        "name": "NumberOfSymbolicFeatures",
        "value": "10.0"
      },
      {
        "name": "PercentageOfBinaryFeatures",
        "value": "30.0"
      },
      {
        "name": "PercentageOfInstancesWithMissingValues",
        "value": "0.0"
      },
      {
        "name": "PercentageOfMissingValues",
        "value": "0.0"
      },
      {
        "name": "PercentageOfNumericFeatures",
        "value": "0.0"
      },
      {
        "name": "PercentageOfSymbolicFeatures",
        "value": "100.0"
      },
      {
        "name": "Quartile1AttributeEntropy",
        "value": "0.6605014935898209"
      },
      {
        "name": "Quartile1KurtosisOfNumericAtts",
        "value": []
      },
      {
        "name": "Quartile1MeansOfNumericAtts",
        "value": []
      },
      {
        "name": "Quartile1MutualInformation",
        "value": "0.0070105800783949995"
      },
      {
        "name": "Quartile1SkewnessOfNumericAtts",
        "value": []
      },
      {
        "name": "Quartile1StdDevOfNumericAtts",
        "value": []
      },
      {
        "name": "Quartile2AttributeEntropy",
        "value": "1.45862326428419"
      },
      {
        "name": "Quartile2KurtosisOfNumericAtts",
        "value": []
      },
      {
        "name": "Quartile2MeansOfNumericAtts",
        "value": []
      },
      {
        "name": "Quartile2MutualInformation",
        "value": "0.02790378922293"
      },
      {
        "name": "Quartile2SkewnessOfNumericAtts",
        "value": []
      },
      {
        "name": "Quartile2StdDevOfNumericAtts",
        "value": []
      },
      {
        "name": "Quartile3AttributeEntropy",
        "value": "1.7244382232185695"
      },
      {
        "name": "Quartile3KurtosisOfNumericAtts",
        "value": []
      },
      {
        "name": "Quartile3MeansOfNumericAtts",
        "value": []
      },
      {
        "name": "Quartile3MutualInformation",
        "value": "0.04169184385698"
      },
      {
        "name": "Quartile3SkewnessOfNumericAtts",
        "value": []
      },
      {
        "name": "Quartile3StdDevOfNumericAtts",
        "value": []
      },
      {
        "name": "REPTreeDepth1AUC",
        "value": "0.6895313334333728"
      },
      {
        "name": "REPTreeDepth1ErrRate",
        "value": "0.4864908854166667"
      },
      {
        "name": "REPTreeDepth1Kappa",
        "value": "0.24330383980951892"
      },
      {
        "name": "REPTreeDepth2AUC",
        "value": "0.6895313334333728"
      },
      {
        "name": "REPTreeDepth2ErrRate",
        "value": "0.4864908854166667"
      },
      {
        "name": "REPTreeDepth2Kappa",
        "value": "0.24330383980951892"
      },
      {
        "name": "REPTreeDepth3AUC",
        "value": "0.6895313334333728"
      },
      {
        "name": "REPTreeDepth3ErrRate",
        "value": "0.4864908854166667"
      },
      {
        "name": "REPTreeDepth3Kappa",
        "value": "0.24330383980951892"
      },
      {
        "name": "RandomTreeDepth1AUC",
        "value": "0.6676138910448792"
      },
      {
        "name": "RandomTreeDepth1ErrRate",
        "value": "0.49602141203703703"
      },
      {
        "name": "RandomTreeDepth1Kappa",
        "value": "0.23003103672206526"
      },
      {
        "name": "RandomTreeDepth2AUC",
        "value": "0.6676138910448792"
      },
      {
        "name": "RandomTreeDepth2ErrRate",
        "value": "0.49602141203703703"
      },
      {
        "name": "RandomTreeDepth2Kappa",
        "value": "0.23003103672206526"
      },
      {
        "name": "RandomTreeDepth3AUC",
        "value": "0.6676138910448792"
      },
      {
        "name": "RandomTreeDepth3ErrRate",
        "value": "0.49602141203703703"
      },
      {
        "name": "RandomTreeDepth3Kappa",
        "value": "0.23003103672206526"
      },
      {
        "name": "StdvNominalAttDistinctValues",
        "value": "0.875595035770913"
      },
      {
        "name": "kNN1NAUC",
        "value": "0.6722682268119131"
      },
      {
        "name": "kNN1NErrRate",
        "value": "0.4943214699074074"
      },
      {
        "name": "kNN1NKappa",
        "value": "0.23184024423191088"
      }
    ]
  }
}