{
  "data_features": {
    "feature": [
      {
        "data_type": "nominal",
        "index": "0",
        "is_ignore": "true",
        "is_row_identifier": "false",
        "is_target": "false",
        "name": "Player",
        "nominal_value": [
          "AARON_WARD",
          "ABNER_DALRYMPLE",
          "ADAM_COMOROSKY",
          "ALAN_ASHBY",
          "ALAN_BANNISTER",
          "ALEX_GRAMMAS",
          "ALEX_JOHNSON",
          "ALEX_TREVINO",
          "ALVIN_DARK",
          "AL_BRIDWELL",
          "AL_BUMBRY",
          "AL_COWENS",
          "AL_EVANS",
          "AL_KALINE",
          "AL_LOPEZ",
          "AL_OLIVER",
          "AL_ROSEN",
          "AL_SIMMONS",
          "AL_SMITH",
          "AL_SPANGLER",
          "AL_TODD",
          "AL_WEIS",
          "AL_ZARILLA",
          "AMOS_OTIS",
          "AMOS_STRUNK",
          "ANDRE_RODGERS",
          "ANDY_CAREY",
          "ANDY_ETCHEBARREN",
          "ANDY_HIGH",
          "ANDY_KOSCO",
          "ANDY_PAFKO",
          "ANDY_SEMINICK",
          "ANDY_THORNTON",
          "ARKY_VAUGHAN",
          "ARLIE_LATHAM",
          "ARTHUR_IRWIN",
          "ART_DEVLIN",
          "ART_FLETCHER",
          "ART_HOWE",
          "ART_JORGENS",
          "ART_WHITNEY",
          "ART_WILSON",
          "AUGIE_GALAN",
          "AURELIO_RODRIGUEZ",
          "BABE_DAHLGREN",
          "BABE_HERMAN",
          "BABE_PHELPS",
          "BABE_RUTH",
          "BABY-DOLL_JACOBSON",
          "BAKE_McBRIDE",
          "BARNEY_GILLIGAN",
          "BARNEY_McCOSKY",
          "BARRY_BONNELL",
          "BARRY_FOOTE",
          "BARRY_McCORMICK",
          "BENNIE_TATE",
          "BENNY_AYALA",
          "BENNY_BENGOUGH",
          "BEN_CHAPMAN",
          "BEN_OGLIVIE",
          "BERNIE_ALLEN",
          "BERNIE_CARBO",
          "BERNIE_FRIBERG",
          "BERT_CAMPANERIS",
          "BIBB_FALK",
          "BID_McPHEE",
          "BIFF_POCOROBA",
          "BILLY_CLINGMAN",
          "BILLY_CONSOLO",
          "BILLY_COX",
          "BILLY_GARDNER",
          "BILLY_GOODMAN",
          "BILLY_HAMILTON",
          "BILLY_HERMAN",
          "BILLY_JURGES",
          "BILLY_KLAUS",
          "BILLY_MARTIN",
          "BILLY_NASH",
          "BILLY_NORTH",
          "BILLY_ROGELL",
          "BILLY_SHINDLE",
          "BILLY_SOUTHWORTH",
          "BILLY_SULLIVAN.JR.",
          "BILLY_SULLIVAN.SR.",
          "BILLY_WERBER",
          "BILLY_WILLIAMS",
          "BILL_ALMON",
          "BILL_BERGEN",
          "BILL_BRADLEY",
          "BILL_BRUBAKER",
          "BILL_BRUTON",
          "BILL_BUCKNER",
          "BILL_CARRIGAN",
          "BILL_DAHLEN",
          "BILL_DICKEY",
          "BILL_FAHEY",
          "BILL_FREEHAN",
          "BILL_HALLMAN",
          "BILL_HINCHMAN",
          "BILL_HOLBERT",
          "BILL_KILLEFER",
          "BILL_KNICKERBOCKER",
          "BILL_KUEHNE",
          "BILL_MADLOCK",
          "BILL_MAZEROSKI",
          "BILL_McKECHNIE",
          "BILL_MELTON",
          "BILL_NICHOLSON",
          "BILL_PHILLIPS",
          "BILL_PLUMMER",
          "BILL_RARIDEN",
          "BILL_ROBINSON",
          "BILL_RUSSELL",
          "BILL_SKOWRON",
          "BILL_STEIN",
          "BILL_TERRY",
          "BILL_TUTTLE",
          "BILL_VIRDON",
          "BILL_WAMBSGANSS",
          "BILL_WHITE",
          "BING_MILLER",
          "BIRDIE_TEBBETTS",
          "BLONDIE_PURCELL",
          "BOBBY_ADAMS",
          "BOBBY_AVILA",
          "BOBBY_BONDS",
          "BOBBY_BYRNE",
          "BOBBY_DOERR",
          "BOBBY_GRICH",
          "BOBBY_LOWE",
          "BOBBY_MURCER",
          "BOBBY_RICHARDSON",
          "BOBBY_THOMSON",
          "BOBBY_TOLAN",
          "BOBBY_VALENTINE",
          "BOBBY_VEACH",
          "BOBBY_WALLACE",
          "BOBBY_WINE",
          "BOB_ALLISON",
          "BOB_ASPROMONTE",
          "BOB_BAILEY",
          "BOB_BAILOR",
          "BOB_BARTON",
          "BOB_BESCHER",
          "BOB_BOONE",
          "BOB_CARUTHERS",
          "BOB_CERV",
          "BOB_DERNIER",
          "BOB_ELLIOTT",
          "BOB_FOTHERGILL",
          "BOB_HEISE",
          "BOB_HORNER",
          "BOB_JOHNSON",
          "BOB_KENNEDY",
          "BOB_LILLIS",
          "BOB_MEUSEL",
          "BOB_MONTGOMERY",
          "BOB_NIEMAN",
          "BOB_OFARRELL",
          "BOB_ROBERTSON",
          "BOB_SKINNER",
          "BOB_STINSON",
          "BOB_SWIFT",
          "BOB_WATSON",
          "BOILERYARD_CLARKE",
          "BONES_ELY",
          "BOOG_POWELL",
          "BO_DIAZ",
          "BRIAN_DOWNING",
          "BROOKS_ROBINSON",
          "BROOK_JACOBY",
          "BRUCE_BENEDICT",
          "BRUCE_BOCHTE",
          "BRUCE_CAMPBELL",
          "BRUCE_EDWARDS",
          "BUBBA_PHILLIPS",
          "BUBBLES_HARGRAVE",
          "BUCKY_DENT",
          "BUCKY_HARRIS",
          "BUCK_EWING",
          "BUCK_FREEMAN",
          "BUCK_HERZOG",
          "BUCK_JORDAN",
          "BUCK_MARTINEZ",
          "BUDDY_BELL",
          "BUDDY_BRADFORD",
          "BUDDY_LEWIS",
          "BUDDY_MYER",
          "BUDDY_ROSAR",
          "BUD_HARRELSON",
          "BUG_HOLLIDAY",
          "BURT_SHOTTON",
          "BUTCH_HENLINE",
          "BUTCH_WYNEGAR",
          "CANDY_LaCHANCE",
          "CAP_ANSON",
          "CARLOS_MAY",
          "CARL_FURILLO",
          "CARL_REYNOLDS",
          "CARL_SAWATSKI",
          "CARL_YASTRZEMSKI",
          "CARMEN_CASTILLO",
          "CARNEY_LANSFORD",
          "CARSON_BIGBEE",
          "CASEY_STENGEL",
          "CASS_MICHAELS",
          "CATFISH_METKOVICH",
          "CECIL_COOPER",
          "CECIL_TRAVIS",
          "CESAR_CEDENO",
          "CESAR_GERONIMO",
          "CESAR_TOVAR",
          "CHAMP_SUMMERS",
          "CHARLEY_JONES",
          "CHARLEY_OLEARY",
          "CHARLEY_SMITH",
          "CHARLIE_BENNETT",
          "CHARLIE_BERRY",
          "CHARLIE_COMISKEY",
          "CHARLIE_DEAL",
          "CHARLIE_GANZEL",
          "CHARLIE_GEHRINGER",
          "CHARLIE_GRIMM",
          "CHARLIE_HEMPHILL",
          "CHARLIE_HICKMAN",
          "CHARLIE_IRWIN",
          "CHARLIE_JAMIESON",
          "CHARLIE_KELLER",
          "CHARLIE_LAU",
          "CHARLIE_MAXWELL",
          "CHARLIE_MOORE",
          "CHARLIE_SILVERA",
          "CHET_LAABS",
          "CHET_LEMON",
          "CHICK_FEWSTER",
          "CHICK_GALLOWAY",
          "CHICK_HAFEY",
          "CHICK_STAHL",
          "CHICO_CARRASQUEL",
          "CHICO_WALKER",
          "CHIEF_ZIMMER",
          "CHIPPY_McGARR",
          "CHRIS_CANNIZZARO",
          "CHRIS_CHAMBLISS",
          "CHRIS_SPEIER",
          "CHUCK_HINTON",
          "CHUCK_KLEIN",
          "CITO_GASTON",
          "CLAUDEL_WASHINGTON",
          "CLAUDE_RITCHEY",
          "CLAY_DALRYMPLE",
          "CLEON_JONES",
          "CLETE_BOYER",
          "CLIFF_CARROLL",
          "CLIFF_HEATHCOTE",
          "CLIFF_JOHNSON",
          "CLINT_COURTNEY",
          "CLINT_HURDLE",
          "CLYDE_MANION",
          "CLYDE_McCULLOUGH",
          "CLYDE_MILAN",
          "CLYDE_SUKEFORTH",
          "CLYDE_VOLLMER",
          "CONNIE_MACK",
          "CONNIE_RYAN",
          "CON_DAILY",
          "COOKIE_LAVAGETTO",
          "COOKIE_ROJAS",
          "COZY_DOLAN",
          "CRAIG_REYNOLDS",
          "CUB_STRICKER",
          "CUPID_CHILDS",
          "CURT_FLOOD",
          "CURT_WALKER",
          "CURT_WELCH",
          "CY_PERKINS",
          "CY_SEYMOUR",
          "CY_WILLIAMS",
          "DALE_BERRA",
          "DALE_LONG",
          "DALE_MITCHELL",
          "DAL_MAXVILL",
          "DAMASO_GARCIA",
          "DANE_IORG",
          "DANNY_CATER",
          "DANNY_HEEP",
          "DANNY_LITWHILER",
          "DANNY_MURPHY",
          "DANNY_OCONNELL",
          "DANNY_RICHARDSON",
          "DAN_BROUTHERS",
          "DAN_DRIESSEN",
          "DAN_FORD",
          "DAN_McGANN",
          "DAN_MEYER",
          "DARRELL_EVANS",
          "DARRELL_PORTER",
          "DARREL_CHANEY",
          "DARYL_SPENCER",
          "DAVEY_JOHNSON",
          "DAVEY_LOPES",
          "DAVE_ANDERSON",
          "DAVE_BANCROFT",
          "DAVE_BERGMAN",
          "DAVE_CASH",
          "DAVE_COLLINS",
          "DAVE_CONCEPCION",
          "DAVE_DUNCAN",
          "DAVE_FOUTZ",
          "DAVE_KINGMAN",
          "DAVE_MAY",
          "DAVE_NELSON",
          "DAVE_PARKER",
          "DAVE_PHILLEY",
          "DAVE_RADER",
          "DAVE_ROBERTS",
          "DAVY_FORCE",
          "DAVY_JONES",
          "DEACON_McGUIRE",
          "DEACON_WHITE",
          "DEBS_GARMS",
          "DEL_CRANDALL",
          "DEL_ENNIS",
          "DEL_GAINER",
          "DEL_PRATT",
          "DEL_RICE",
          "DEL_UNSER",
          "DENIS_MENKE",
          "DENNY_LYONS",
          "DENNY_WALLING",
          "DERON_JOHNSON",
          "DERREL_THOMAS",
          "DICK_ALLEN",
          "DICK_BARTELL",
          "DICK_GERNERT",
          "DICK_GREEN",
          "DICK_GROAT",
          "DICK_HOBLITZEL",
          "DICK_McAULIFFE",
          "DICK_SCHOFIELD.SR.",
          "DICK_SIEBERT",
          "DICK_STUART",
          "DICK_WILLIAMS",
          "DIXIE_WALKER",
          "DOC_BUSHONG",
          "DOC_CASEY",
          "DOC_CRAMER",
          "DOC_JOHNSTON",
          "DOC_LAVAN",
          "DODE_PASKERT",
          "DOGGIE_MILLER",
          "DOLPH_CAMILLI",
          "DOM_DiMAGGIO",
          "DONIE_BUSH",
          "DONN_CLENDENON",
          "DON_BAYLOR",
          "DON_BLASINGAME",
          "DON_BUFORD",
          "DON_DEMETER",
          "DON_GUTTERIDGE",
          "DON_HEFFNER",
          "DON_HOAK",
          "DON_KESSINGER",
          "DON_KOLLOWAY",
          "DON_MINCHER",
          "DON_MONEY",
          "DON_MUELLER",
          "DON_PAVLETICH",
          "DON_ZIMMER",
          "DOTS_MILLER",
          "DOUG_DeCINCES",
          "DOUG_FLYNN",
          "DOUG_RADER",
          "DUANE_KUIPER",
          "DUCKY_HOLMES",
          "DUDE_ESTERBROOK",
          "DUFFY_DYER",
          "DUFFY_LEWIS",
          "DUFF_COOLEY",
          "DUKE_FARRELL",
          "DUKE_SIMS",
          "DUKE_SNIDER",
          "DUMMY_HOY",
          "DUSTY_BAKER",
          "DWAYNE_MURPHY",
          "DWIGHT_EVANS",
          "EARLE_COMBS",
          "EARL_AVERILL",
          "EARL_BATTEY",
          "EARL_SMITH",
          "EARL_TORGESON",
          "EDDIE_AINSMITH",
          "EDDIE_BRESSOUD",
          "EDDIE_COLLINS",
          "EDDIE_FOSTER",
          "EDDIE_GRANT",
          "EDDIE_JOOST",
          "EDDIE_KASKO",
          "EDDIE_LAKE",
          "EDDIE_MATHEWS",
          "EDDIE_MIKSIS",
          "EDDIE_MILLER",
          "EDDIE_MOORE",
          "EDDIE_MURRAY",
          "EDDIE_ROBINSON",
          "EDDIE_STANKY",
          "EDDIE_WAITKUS",
          "EDDIE_YOST",
          "EDD_ROUSH",
          "ED_BAILEY",
          "ED_BRINKMAN",
          "ED_DELAHANTY",
          "ED_FITZGERALD",
          "ED_HERRMANN",
          "ED_KIRKPATRICK",
          "ED_KONETCHY",
          "ED_KRANEPOOL",
          "ED_McFARLAND",
          "ED_McKEAN",
          "ED_PHELPS",
          "ED_ROMERO",
          "ELBIE_FLETCHER",
          "ELLIE_HENDRICKS",
          "ELLIOTT_MADDOX",
          "ELLIS_VALENTINE",
          "ELMER_FLICK",
          "ELMER_SMITH",
          "ELMER_VALO",
          "ELSTON_HOWARD",
          "ENOS_CABELL",
          "ENOS_SLAUGHTER",
          "ERIC_McNAIR",
          "ERNIE_BANKS",
          "ERNIE_JOHNSON",
          "ERNIE_LOMBARDI",
          "ERNIE_WHITT",
          "ETHAN_ALLEN",
          "EVERETT_SCOTT",
          "EZRA_SUTTON",
          "FARMER_VAUGHN",
          "FELIPE_ALOU",
          "FELIX_MANTILLA",
          "FELIX_MILLAN",
          "FIELDER_JONES",
          "FLOYD_BAKER",
          "FRANKIE_CROSETTI",
          "FRANKIE_FRISCH",
          "FRANKIE_GUSTINE",
          "FRANKIE_HAYES",
          "FRANKIE_PYTLAK",
          "FRANK_BAKER",
          "FRANK_BAUMHOLTZ",
          "FRANK_BOLLING",
          "FRANK_BOWERMAN",
          "FRANK_CHANCE",
          "FRANK_DEMAREE",
          "FRANK_DUFFY",
          "FRANK_HANKINSON",
          "FRANK_HOUSE",
          "FRANK_HOWARD",
          "FRANK_ISBELL",
          "FRANK_LaPORTE",
          "FRANK_MALZONE",
          "FRANK_McCORMICK",
          "FRANK_OROURKE",
          "FRANK_ROBINSON",
          "FRANK_SCHULTE",
          "FRANK_SNYDER",
          "FRANK_TAVERAS",
          "FRANK_THOMAS",
          "FRANK_WHITE",
          "FREDDIE_PATEK",
          "FREDDY_LEACH",
          "FREDDY_LINDSTROM",
          "FREDDY_PARENT",
          "FRED_CLARKE",
          "FRED_DUNLAP",
          "FRED_JACKLITSCH",
          "FRED_KENDALL",
          "FRED_LYNN",
          "FRED_MERKLE",
          "FRED_PFEFFER",
          "FRED_SCHULTE",
          "FRED_STANLEY",
          "FRED_TENNEY",
          "FRENCHY_BORDAGARAY",
          "GABBY_HARTNETT",
          "GARRY_MADDOX",
          "GARRY_TEMPLETON",
          "GARY_CARTER",
          "GARY_GEIGER",
          "GARY_MATTHEWS",
          "GARY_PETTIS",
          "GARY_ROENICKE",
          "GARY_SUTHERLAND",
          "GARY_WARD",
          "GATES_BROWN",
          "GAVVY_CRAVATH",
          "GEE_WALKER",
          "GENE_ALLEY",
          "GENE_CLINES",
          "GENE_DeMONTREVILLE",
          "GENE_DESAUTELS",
          "GENE_FREESE",
          "GENE_MICHAEL",
          "GENE_MOORE",
          "GENE_OLIVER",
          "GENE_STEPHENS",
          "GENE_TENACE",
          "GENE_WOODLING",
          "GEORGE-TIOGA_BURNS",
          "GEORGE_BROWNE",
          "GEORGE_BURNS",
          "GEORGE_CASE",
          "GEORGE_CUTSHAW",
          "GEORGE_DAVIS",
          "GEORGE_FOSTER",
          "GEORGE_GIBSON",
          "GEORGE_GORE",
          "GEORGE_GRANTHAM",
          "GEORGE_HARPER",
          "GEORGE_HENDRICK",
          "GEORGE_KELL",
          "GEORGE_KELLY",
          "GEORGE_McBRIDE",
          "GEORGE_McQUINN",
          "GEORGE_MITTERWALD",
          "GEORGE_MORIARTY",
          "GEORGE_PINKNEY",
          "GEORGE_SCOTT",
          "GEORGE_SHOCH",
          "GEORGE_SISLER",
          "GEORGE_STOVALL",
          "GEORGE_STRICKLAND",
          "GEORGE_THOMAS",
          "GEORGE_VanHALTREN",
          "GEORGE_WOOD",
          "GERMANY_SCHAEFER",
          "GERMANY_SMITH",
          "GIL_COAN",
          "GIL_HODGES",
          "GIL_McDOUGALD",
          "GINGER_BEAUMONT",
          "GINO_CIMOLI",
          "GLENN_BECKERT",
          "GLENN_HUBBARD",
          "GLENN_MYATT",
          "GLENN_WRIGHT",
          "GOOSE_GOSLIN",
          "GORMAN_THOMAS",
          "GRADY_HATTON",
          "GRAIG_NETTLES",
          "GRANNY_HAMNER",
          "GREG_BROCK",
          "GREG_GROSS",
          "GREG_LUZINSKI",
          "GREG_PRYOR",
          "GROVER_HARTLEY",
          "GUS_BELL",
          "GUS_MANCUSO",
          "GUS_SUHR",
          "GUS_TRIANDOS",
          "GUS_ZERNIAL",
          "HACK_WILSON",
          "HAL_CHASE",
          "HAL_JANVRIN",
          "HAL_JEFFCOAT",
          "HAL_LANIER",
          "HAL_McRAE",
          "HAL_NARAGON",
          "HAL_SMITH",
          "HAL_TROSKY",
          "HAL_WAGNER",
          "HANK_AARON",
          "HANK_BAUER",
          "HANK_DeBERRY",
          "HANK_EDWARDS",
          "HANK_FOILES",
          "HANK_GOWDY",
          "HANK_GREENBERG",
          "HANK_LEIBER",
          "HANK_MAJESKI",
          "HANK_SAUER",
          "HANK_SEVEREID",
          "HANS_LOBERT",
          "HARDY_RICHARDSON",
          "HARLOND_CLIFT",
          "HARMON_KILLEBREW",
          "HARRY_CHITI",
          "HARRY_DANNING",
          "HARRY_DAVIS",
          "HARRY_HEILMANN",
          "HARRY_HOOPER",
          "HARRY_McCURDY",
          "HARRY_RICE",
          "HARRY_SMITH",
          "HARRY_SPILMAN",
          "HARRY_STEINFELDT",
          "HARRY_STOVEY",
          "HARRY_WALKER",
          "HARVEY_HENDRICK",
          "HARVEY_KUENN",
          "HAWK_TAYLOR",
          "HECTOR_LOPEZ",
          "HEINIE_GROH",
          "HEINIE_MANUSH",
          "HEINIE_MUELLER",
          "HEINIE_PEITZ",
          "HEINIE_WAGNER",
          "HEINIE_ZIMMERMAN",
          "HENRY_LARKIN",
          "HERMAN_LONG",
          "HICK_CARPENTER",
          "HOBIE_LANDRITH",
          "HOD_FORD",
          "HOMER_SUMMA",
          "HONUS_WAGNER",
          "HOOT_EVERS",
          "HORACE_CLARKE",
          "HOWIE_SHANKS",
          "HUGHIE_CRITZ",
          "HUGHIE_JENNINGS",
          "HUGH_DUFFY",
          "HUGH_NICOL",
          "HY_MYERS",
          "INDIAN-BOB_JOHNSON",
          "IRA_FLAGSTEAD",
          "IRA_THOMAS",
          "IRISH_MEUSEL",
          "IRV_NOREN",
          "IVAL_GOODMAN",
          "IVAN_DeJESUS",
          "IVAN_MURRELL",
          "IVEY_WINGO",
          "IVY_OLSON",
          "J.C._MARTIN",
          "JACKIE_BRANDT",
          "JACKIE_HAYES",
          "JACKIE_JENSEN",
          "JACKIE_ROBINSON",
          "JACK_BARRY",
          "JACK_BOYLE",
          "JACK_BURDOCK",
          "JACK_CLARK",
          "JACK_CLEMENTS",
          "JACK_DOYLE",
          "JACK_FARRELL",
          "JACK_FOURNIER",
          "JACK_GLASSCOCK",
          "JACK_GRANEY",
          "JACK_McCARTHY",
          "JACK_OCONNOR",
          "JACK_ROTHROCK",
          "JACK_ROWE",
          "JACK_RYAN",
          "JACK_SMITH",
          "JACK_TOBIN",
          "JAKE_BECKLEY",
          "JAKE_DAUBERT",
          "JAKE_FLOWERS",
          "JAKE_GIBBS",
          "JAKE_POWELL",
          "JAMIE_QUIRK",
          "JASON_THOMPSON",
          "JAY_JOHNSTONE",
          "JEFFREY_LEONARD",
          "JEFF_BURROUGHS",
          "JEFF_HEATH",
          "JEFF_TORBORG",
          "JERRY_ADAIR",
          "JERRY_DENNY",
          "JERRY_GROTE",
          "JERRY_HAIRSTON",
          "JERRY_LYNCH",
          "JERRY_MARTIN",
          "JERRY_MAY",
          "JERRY_MORALES",
          "JERRY_MUMPHREY",
          "JERRY_PRIDDY",
          "JERRY_REMY",
          "JERRY_ROYSTER",
          "JERRY_TURNER",
          "JERRY_WHITE",
          "JESSE_BARFIELD",
          "JESSE_BURKETT",
          "JESUS_ALOU",
          "JIM-RAY_HART",
          "JIMMIE_FOXX",
          "JIMMIE_WILSON",
          "JIMMY_ARCHER",
          "JIMMY_AUSTIN",
          "JIMMY_BARRETT",
          "JIMMY_BLOODWORTH",
          "JIMMY_COLLINS",
          "JIMMY_DYKES",
          "JIMMY_JOHNSTON",
          "JIMMY_McALEER",
          "JIMMY_OUTLAW",
          "JIMMY_RYAN",
          "JIMMY_SHECKARD",
          "JIMMY_SLAGLE",
          "JIMMY_STEWART",
          "JIMMY_WASDELL",
          "JIMMY_WILLIAMS",
          "JIMMY_WOLF",
          "JIM_BEAUCHAMP",
          "JIM_BOTTOMLEY",
          "JIM_BUSBY",
          "JIM_DAVENPORT",
          "JIM_DELAHANTY",
          "JIM_DELSING",
          "JIM_DONNELLY",
          "JIM_DWYER",
          "JIM_ESSIAN",
          "JIM_FREGOSI",
          "JIM_GANTNER",
          "JIM_GILLIAM",
          "JIM_GOSGER",
          "JIM_HEGAN",
          "JIM_HICKMAN",
          "JIM_KEENAN",
          "JIM_KING",
          "JIM_LANDIS",
          "JIM_LEMON",
          "JIM_MORRISON",
          "JIM_NORTHRUP",
          "JIM_OROURKE",
          "JIM_PAGLIARONI",
          "JIM_PIERSALL",
          "JIM_RICE",
          "JIM_RIVERA",
          "JIM_RUSSELL",
          "JIM_SPENCER",
          "JIM_SUNDBERG",
          "JIM_WOHLFORD",
          "JIM_WYNN",
          "JO-JO_MOORE",
          "JOCKO_MILLIGAN",
          "JODY_DAVIS",
          "JOEL_YOUNGBLOOD",
          "JOEY_AMALFITANO",
          "JOE_ADCOCK",
          "JOE_ASTROTH",
          "JOE_AZCUE",
          "JOE_COLLINS",
          "JOE_CRONIN",
          "JOE_CUNNINGHAM",
          "JOE_DeMAESTRI",
          "JOE_DiMAGGIO",
          "JOE_DUGAN",
          "JOE_EVANS",
          "JOE_FERGUSON",
          "JOE_GERHARDT",
          "JOE_GINSBERG",
          "JOE_GORDON",
          "JOE_HARRIS",
          "JOE_HORNUNG",
          "JOE_JACKSON",
          "JOE_JUDGE",
          "JOE_KELLEY",
          "JOE_KUHEL",
          "JOE_LAHOUD",
          "JOE_MEDWICK",
          "JOE_MORGAN",
          "JOE_MULVEY",
          "JOE_NOLAN",
          "JOE_PEPITONE",
          "JOE_QUINN",
          "JOE_RUDI",
          "JOE_SCHULTZ",
          "JOE_SEWELL",
          "JOE_SOMMER",
          "JOE_START",
          "JOE_STRIPP",
          "JOE_SUGDEN",
          "JOE_TINKER",
          "JOE_TORRE",
          "JOE_VOSMIK",
          "JOE_YEAGER",
          "JOHNNIE_LeMASTER",
          "JOHNNY_BENCH",
          "JOHNNY_BERARDINO",
          "JOHNNY_CALLISON",
          "JOHNNY_COONEY",
          "JOHNNY_EDWARDS",
          "JOHNNY_EVERS",
          "JOHNNY_GOOCH",
          "JOHNNY_GROTH",
          "JOHNNY_GRUBB",
          "JOHNNY_HOPP",
          "JOHNNY_KLING",
          "JOHNNY_LINDELL",
          "JOHNNY_LOGAN",
          "JOHNNY_McCARTHY",
          "JOHNNY_MIZE",
          "JOHNNY_MOORE",
          "JOHNNY_MOSTIL",
          "JOHNNY_OATES",
          "JOHNNY_PESKY",
          "JOHNNY_RAWLINGS",
          "JOHNNY_RAY",
          "JOHNNY_ROMANO",
          "JOHNNY_ROSEBORO",
          "JOHNNY_TEMPLE",
          "JOHNNY_WYROSTEK",
          "JOHN_ANDERSON",
          "JOHN_BATEMAN",
          "JOHN_BOCCABELLA",
          "JOHN_BRIGGS",
          "JOHN_CASSIDY",
          "JOHN_ELLIS",
          "JOHN_GRIM",
          "JOHN_HUMMEL",
          "JOHN_KENNEDY",
          "JOHN_LOWENSTEIN",
          "JOHN_MAYBERRY",
          "JOHN_McGRAW",
          "JOHN_MILNER",
          "JOHN_MORRILL",
          "JOHN_MOSES",
          "JOHN_REILLY",
          "JOHN_SHELBY",
          "JOHN_STEARNS",
          "JOHN_STEPHENSON",
          "JOHN_STONE",
          "JOHN_TITUS",
          "JOHN_VUKOVICH",
          "JOHN_WARD",
          "JOHN_WARNER",
          "JOHN_WATHAN",
          "JOHN_WOCKENFUSS",
          "JORGE_ORTA",
          "JOSE_CARDENAL",
          "JOSE_CRUZ",
          "JOSE_MORALES",
          "JOSE_PAGAN",
          "JOSH_BILLINGS",
          "JUAN_BENIQUEZ",
          "JULIAN_JAVIER",
          "JULIO_CRUZ",
          "JULIO_GOTAY",
          "KEITH_HERNANDEZ",
          "KEITH_MORELAND",
          "KEN_BERRY",
          "KEN_BOSWELL",
          "KEN_BOYER",
          "KEN_GRIFFEY",
          "KEN_HENDERSON",
          "KEN_KELTNER",
          "KEN_LANDREAUX",
          "KEN_McMULLEN",
          "KEN_OBERKFELL",
          "KEN_ODEA",
          "KEN_PHELPS",
          "KEN_REITZ",
          "KEN_SINGLETON",
          "KEN_WILLIAMS",
          "KID_ELBERFELD",
          "KID_GLEASON",
          "KIKI_CUYLER",
          "KIKO_GARCIA",
          "KING_KELLY",
          "KIP_SELBACH",
          "KITTY_BRANSFIELD",
          "KURT_BEVACQUA",
          "LARRY_BIITTNER",
          "LARRY_BOWA",
          "LARRY_BROWN",
          "LARRY_DOBY",
          "LARRY_DOYLE",
          "LARRY_GARDNER",
          "LARRY_HANEY",
          "LARRY_HERNDON",
          "LARRY_HISLE",
          "LARRY_KOPF",
          "LARRY_McLEAN",
          "LARRY_MILBOURNE",
          "LARRY_PARRISH",
          "LARRY_STAHL",
          "LARRY_WOODALL",
          "LAVE_CROSS",
          "LEE_HANDLEY",
          "LEE_LACY",
          "LEE_MAY",
          "LEE_MAYE",
          "LEE_MAZZILLI",
          "LEE_TANNEHILL",
          "LEE_WALLS",
          "LEFTY_ODOUL",
          "LENNY_GREEN",
          "LENN_SAKATA",
          "LEN_RANDLE",
          "LEON_DURHAM",
          "LEON_ROBERTS",
          "LEON_WAGNER",
          "LEO_CARDENAS",
          "LEO_DUROCHER",
          "LES_MANN",
          "LES_MOSS",
          "LES_NUNAMAKER",
          "LEW_FONSECA",
          "LEW_RIGGS",
          "LLOYD_MOSEBY",
          "LLOYD_WANER",
          "LONNY_FREY",
          "LOU_BIERBAUER",
          "LOU_BOUDREAU",
          "LOU_BROCK",
          "LOU_CRIGER",
          "LOU_FINNEY",
          "LOU_GEHRIG",
          "LOU_KLIMCHOCK",
          "LOU_PINIELLA",
          "LUIS_AGUAYO",
          "LUIS_APARICIO",
          "LUIS_SALAZAR",
          "LUKE_APPLING",
          "LUKE_SEWELL",
          "LU_BLUE",
          "LYN_LARY",
          "MACK_JONES",
          "MALACHI_KITTRIDGE",
          "MANNY_MOTA",
          "MANNY_SANGUILLEN",
          "MANNY_TRILLO",
          "MARC_HILL",
          "MARK_BELANGER",
          "MARK_KOENIG",
          "MARTY_BARRETT",
          "MARTY_KEOUGH",
          "MARTY_MARION",
          "MARTY_McMANUS",
          "MARTY_PEREZ",
          "MATTY_ALOU",
          "MATTY_McINTYRE",
          "MATT_BATTS",
          "MATT_SINATRO",
          "MAURY_WILLS",
          "MAX_BISHOP",
          "MAX_CAREY",
          "MAX_FLACK",
          "MAX_VENABLE",
          "MEL_OTT",
          "MERV_RETTENMUND",
          "MERV_SHEA",
          "MICKEY_COCHRANE",
          "MICKEY_DOOLAN",
          "MICKEY_HATCHER",
          "MICKEY_LIVINGSTON",
          "MICKEY_MANTLE",
          "MICKEY_OWEN",
          "MICKEY_RIVERS",
          "MICKEY_STANLEY",
          "MICKEY_VERNON",
          "MICK_KELLEHER",
          "MIGUEL_DILONE",
          "MIKE_DAVIS",
          "MIKE_DONLIN",
          "MIKE_DORGAN",
          "MIKE_EASLER",
          "MIKE_FISCHLIN",
          "MIKE_FITZGERALD",
          "MIKE_GONZALEZ",
          "MIKE_GRADY",
          "MIKE_GRIFFIN",
          "MIKE_HARGROVE",
          "MIKE_HEATH",
          "MIKE_HEGAN",
          "MIKE_HERSHBERGER",
          "MIKE_IVIE",
          "MIKE_JORGENSEN",
          "MIKE_KAHOE",
          "MIKE_KREEVICH",
          "MIKE_MARSHALL",
          "MIKE_McCORMICK",
          "MIKE_McNALLY",
          "MIKE_MOWREY",
          "MIKE_PHILLIPS",
          "MIKE_POWERS",
          "MIKE_RYAN",
          "MIKE_SCHMIDT",
          "MIKE_SCIOSCIA",
          "MIKE_SQUIRES",
          "MIKE_TIERNAN",
          "MIKE_TRESH",
          "MIKE_TYSON",
          "MIKE_VAIL",
          "MILLER_HUGGINS",
          "MILT_MAY",
          "MILT_STOCK",
          "MINNIE_MINOSO",
          "MOE_BERG",
          "MONTE_CROSS",
          "MOOKIE_WILSON",
          "MORGAN_MURPHY",
          "MUDDY_RUEL",
          "MULE_HAAS",
          "MYRIL_HOAG",
          "NAP_LAJOIE",
          "NATE_COLBERT",
          "NED_HANLON",
          "NED_WILLIAMSON",
          "NELLIE_FOX",
          "NEMO_LEIBOLD",
          "NIXEY_CALLAHAN",
          "NORM_CASH",
          "NORM_MILLER",
          "NORM_SIEBERN",
          "ODELL_HALE",
          "OLLIE_BROWN",
          "OMAR_MORENO",
          "ORATOR_SHAFFER",
          "ORLANDO_CEPEDA",
          "OSCAR_GAMBLE",
          "OSCAR_STANAGE",
          "OSSE_SCHRECKENGOST",
          "OSSIE_BLUEGE",
          "OSSIE_VITT",
          "OTTO_KNABE",
          "OTTO_MILLER",
          "OTTO_VELEZ",
          "OYSTER_BURNS",
          "OZZIE_VIRGIL.JR.",
          "PATSY_DONOVAN",
          "PATSY_DOUGHERTY",
          "PATSY_GHARRITY",
          "PATSY_TEBEAU",
          "PAT_COLLINS",
          "PAT_KELLY",
          "PAT_MORAN",
          "PAT_MULLIN",
          "PAT_TABLER",
          "PAUL_BLAIR",
          "PAUL_CASANOVA",
          "PAUL_HINES",
          "PAUL_POPOVICH",
          "PAUL_RADFORD",
          "PAUL_SCHAAL",
          "PAUL_WANER",
          "PEANUTS_LOWREY",
          "PEDRO_GUERRERO",
          "PEE-WEE_REESE",
          "PEPPER_MARTIN",
          "PEP_YOUNG",
          "PETE_BROWNING",
          "PETE_FOX",
          "PETE_REISER",
          "PETE_ROSE",
          "PETE_RUNNELS",
          "PETE_SUDER",
          "PHIL_CAVARRETTA",
          "PHIL_GAGLIANO",
          "PHIL_GARNER",
          "PHIL_MASI",
          "PHIL_RIZZUTO",
          "PHIL_ROOF",
          "PIE_TRAYNOR",
          "PINCH_THOMAS",
          "PINKY_HARGRAVE",
          "PINKY_HIGGINS",
          "PINKY_WHITNEY",
          "POP_CORKHILL",
          "POP_SCHRIVER",
          "POP_SMITH",
          "POP_SNYDER",
          "POSSUM_WHITTED",
          "RABBIT_MARANVILLE",
          "RABBIT_WARSTLER",
          "RAFAEL_RAMIREZ",
          "RALPH_GARR",
          "RALPH_KINER",
          "RANCE_MULLINIKS",
          "RANDY_HUNDLEY",
          "RANDY_JACKSON",
          "RANDY_MOORE",
          "RAY_BERRES",
          "RAY_BLADES",
          "RAY_BOONE",
          "RAY_FOSSE",
          "RAY_HAYWORTH",
          "RAY_KNIGHT",
          "RAY_MUELLER",
          "RAY_SCHALK",
          "RED_DOOIN",
          "RED_KRESS",
          "RED_MURRAY",
          "RED_ROLFE",
          "RED_SCHOENDIENST",
          "RED_WILSON",
          "REGGIE_JACKSON",
          "REGGIE_SMITH",
          "RENNIE_STENNETT",
          "RENO_BERTOIA",
          "RICHIE_ASHBURN",
          "RICHIE_HEBNER",
          "RICHIE_ZISK",
          "RICH_DAUER",
          "RICH_GEDMAN",
          "RICH_REESE",
          "RICH_ROLLINS",
          "RICK_AUERBACH",
          "RICK_BURLESON",
          "RICK_CERONE",
          "RICK_DEMPSEY",
          "RICK_FERRELL",
          "RICK_LEACH",
          "RICK_MANNING",
          "RICK_MILLER",
          "RICK_MONDAY",
          "RICK_REICHARDT",
          "RICO_CARTY",
          "RICO_PETROCELLI",
          "RIGGS_STEPHENSON",
          "RIP_RADCLIFF",
          "ROBERTO_CLEMENTE",
          "ROB_WILFONG",
          "ROCKY_BRIDGES",
          "ROCKY_COLAVITO",
          "ROD_CAREW",
          "ROGERS_HORNSBY",
          "ROGER_BRESNAHAN",
          "ROGER_CONNOR",
          "ROGER_MARIS",
          "ROGER_METZGER",
          "ROGER_PECKINPAUGH",
          "ROLLIE_HEMSLEY",
          "RON_CEY",
          "RON_FAIRLY",
          "RON_HANSEN",
          "RON_HASSEY",
          "RON_HODGES",
          "RON_HUNT",
          "RON_JACKSON",
          "RON_KITTLE",
          "RON_NORTHEY",
          "RON_OESTER",
          "RON_SANTO",
          "RON_WASHINGTON",
          "ROSS_YOUNGS",
          "ROWLAND_OFFICE",
          "ROXY_WALTERS",
          "ROY_CAMPANELLA",
          "ROY_CULLENBINE",
          "ROY_HARTZELL",
          "ROY_HOWELL",
          "ROY_JOHNSON",
          "ROY_McMILLAN",
          "ROY_SIEVERS",
          "ROY_SMALLEY.JR.",
          "ROY_SMALLEY.SR.",
          "ROY_SPENCER",
          "ROY_THOMAS",
          "ROY_WEATHERLY",
          "ROY_WHITE",
          "RUBEN_AMARO",
          "RUBE_BRESSLER",
          "RUBE_OLDRING",
          "RUBE_WALKER",
          "RUDY_YORK",
          "RUPPERT_JONES",
          "RUSS_NIXON",
          "RUSS_SNYDER",
          "RUSTY_PETERS",
          "RUSTY_STAUB",
          "SAL_BANDO",
          "SAMMY_ESPOSITO",
          "SAMMY_HALE",
          "SAMMY_STRANG",
          "SAMMY_WHITE",
          "SAM_CHAPMAN",
          "SAM_CRAWFORD",
          "SAM_LESLIE",
          "SAM_MELE",
          "SAM_MERTES",
          "SAM_RICE",
          "SAM_THOMPSON",
          "SAM_WEST",
          "SAM_WISE",
          "SANDY_ALOMAR",
          "SHAD_BARRY",
          "SHANO_COLLINS",
          "SHANTY_HOGAN",
          "SHERM_LOLLAR",
          "SHERRY_MAGEE",
          "SHERRY_ROBERTSON",
          "SIBBY_SISTI",
          "SID_GORDON",
          "SILVER_FLINT",
          "SIXTO_LEZCANO",
          "SKEETER_NEWSOME",
          "SKEETER_WEBB",
          "SKI_MELILLO",
          "SMOKY_BURGESS",
          "SNUFFY_STIRNWEISS",
          "SOLLY_HEMUS",
          "SOLLY_HOFMAN",
          "SONNY_JACKSON",
          "SPARKY_ADAMS",
          "SPUD_DAVIS",
          "STAN_HACK",
          "STAN_LOPATA",
          "STAN_MUSIAL",
          "STEVE_BILKO",
          "STEVE_BRAUN",
          "STEVE_BRODIE",
          "STEVE_GARVEY",
          "STEVE_HENDERSON",
          "STEVE_KEMP",
          "STEVE_LAKE",
          "STEVE_ONEILL",
          "STEVE_YEAGER",
          "STUFFY_McINNIS",
          "TAYLOR_DOUTHIT",
          "TED_KLUSZEWSKI",
          "TED_KUBIAK",
          "TED_LEPCIO",
          "TED_SIMMONS",
          "TED_SIZEMORE",
          "TED_WILLIAMS",
          "TERRY_CROWLEY",
          "TERRY_FRANCONA",
          "TERRY_HARMON",
          "TERRY_KENNEDY",
          "TERRY_MOORE",
          "TERRY_PUHL",
          "TERRY_TURNER",
          "TERRY_WHITFIELD",
          "THAD_BOSLEY",
          "THURMAN_MUNSON",
          "TILLY_WALKER",
          "TIM_FLANNERY",
          "TIM_FOLI",
          "TIM_McCARVER",
          "TIP_ONEILL",
          "TITO_FRANCONA",
          "TITO_FUENTES",
          "TOBY_HARRAH",
          "TOMMIE_AGEE",
          "TOMMY_CLARKE",
          "TOMMY_CORCORAN",
          "TOMMY_DAVIS",
          "TOMMY_DOWD",
          "TOMMY_GRIFFITH",
          "TOMMY_HARPER",
          "TOMMY_HELMS",
          "TOMMY_HENRICH",
          "TOMMY_HOLMES",
          "TOMMY_LEACH",
          "TOMMY_McCARTHY",
          "TOMMY_McCRAW",
          "TOMMY_THEVENOW",
          "TOMMY_TUCKER",
          "TOM_BROOKENS",
          "TOM_BROWN",
          "TOM_BURNS",
          "TOM_DALY",
          "TOM_EGAN",
          "TOM_HALLER",
          "TOM_HERR",
          "TOM_HUTTON",
          "TOM_KINSLOW",
          "TOM_NEEDHAM",
          "TOM_PACIOREK",
          "TOM_SATRIANO",
          "TOM_VERYZER",
          "TOM_YORK",
          "TONY_ARMAS",
          "TONY_BERNAZARD",
          "TONY_CUCCINELLO",
          "TONY_GONZALEZ",
          "TONY_LAZZERI",
          "TONY_OLIVA",
          "TONY_PEREZ",
          "TONY_SCOTT",
          "TONY_TAYLOR",
          "TOPSY_HARTSEL",
          "TRAVIS_JACKSON",
          "TRIS_SPEAKER",
          "TUCK_STAINBACK",
          "TY_CLINE",
          "TY_COBB",
          "U.L._WASHINGTON",
          "VADA_PINSON",
          "VAL_PICINICH",
          "VANCE_LAW",
          "VERN_STEPHENS",
          "VIC_DAVALILLO",
          "VIC_POWER",
          "VIC_WERTZ",
          "VINCE_DiMAGGIO",
          "VON_HAYES",
          "VON_JOSHUA",
          "WALKER_COOPER",
          "WALLY_BERGER",
          "WALLY_GERBER",
          "WALLY_MOON",
          "WALLY_MOSES",
          "WALLY_PIPP",
          "WALLY_POST",
          "WALLY_SCHANG",
          "WALLY_WESTLAKE",
          "WALTER_HOLKE",
          "WALTER_SCHMIDT",
          "WALTON_CRUISE",
          "WALT_DROPO",
          "WALT_WILLIAMS",
          "WALT_WILMOT",
          "WARREN_CROMARTIE",
          "WAYNE_CAUSEY",
          "WAYNE_GARRETT",
          "WAYNE_GROSS",
          "WAYNE_TOLLESON",
          "WES_COVINGTON",
          "WES_WESTRUM",
          "WHITEY_LOCKMAN",
          "WHITEY_WITT",
          "WID_CONROY",
          "WILBERT_ROBINSON",
          "WILBUR_GOOD",
          "WILLARD_MARSHALL",
          "WILLIE_CRAWFORD",
          "WILLIE_DAVIS",
          "WILLIE_HORTON",
          "WILLIE_JONES",
          "WILLIE_KAMM",
          "WILLIE_KEELER",
          "WILLIE_MAYS",
          "WILLIE_McCOVEY",
          "WILLIE_MONTANEZ",
          "WILLIE_RANDOLPH",
          "WILLIE_STARGELL",
          "WILLIE_UPSHAW",
          "WOODIE_HELD",
          "WOODY_ENGLISH",
          "YANK_ROBINSON",
          "YOGI_BERRA",
          "ZACK_TAYLOR",
          "ZACK_WHEAT",
          "ZOILO_VERSALLES"
        ],
        "number_of_missing_values": "0"
      },
      {
        "data_type": "numeric",
        "index": "1",
        "is_ignore": "false",
        "is_row_identifier": "false",
        "is_target": "false",
        "name": "Number_seasons",
        "number_of_missing_values": "0"
      },
      {
        "data_type": "numeric",
        "index": "2",
        "is_ignore": "false",
        "is_row_identifier": "false",
        "is_target": "false",
        "name": "Games_played",
        "number_of_missing_values": "0"
      },
      {
        "data_type": "numeric",
        "index": "3",
        "is_ignore": "false",
        "is_row_identifier": "false",
        "is_target": "false",
        "name": "At_bats",
        "number_of_missing_values": "0"
      },
      {
        "data_type": "numeric",
        "index": "4",
        "is_ignore": "false",
        "is_row_identifier": "false",
        "is_target": "false",
        "name": "Runs",
        "number_of_missing_values": "0"
      },
      {
        "data_type": "numeric",
        "index": "5",
        "is_ignore": "false",
        "is_row_identifier": "false",
        "is_target": "false",
        "name": "Hits",
        "number_of_missing_values": "0"
      },
      {
        "data_type": "numeric",
        "index": "6",
        "is_ignore": "false",
        "is_row_identifier": "false",
        "is_target": "false",
        "name": "Doubles",
        "number_of_missing_values": "0"
      },
      {
        "data_type": "numeric",
        "index": "7",
        "is_ignore": "false",
        "is_row_identifier": "false",
        "is_target": "false",
        "name": "Triples",
        "number_of_missing_values": "0"
      },
      {
        "data_type": "numeric",
        "index": "8",
        "is_ignore": "false",
        "is_row_identifier": "false",
        "is_target": "false",
        "name": "Home_runs",
        "number_of_missing_values": "0"
      },
      {
        "data_type": "numeric",
        "index": "9",
        "is_ignore": "false",
        "is_row_identifier": "false",
        "is_target": "false",
        "name": "RBIs",
        "number_of_missing_values": "0"
      },
      {
        "data_type": "numeric",
        "index": "10",
        "is_ignore": "false",
        "is_row_identifier": "false",
        "is_target": "false",
        "name": "Walks",
        "number_of_missing_values": "0"
      },
      {
        "data_type": "numeric",
        "index": "11",
        "is_ignore": "false",
        "is_row_identifier": "false",
        "is_target": "false",
        "name": "Strikeouts",
        "number_of_missing_values": "0"
      },
      {
        "data_type": "numeric",
        "index": "12",
        "is_ignore": "false",
        "is_row_identifier": "false",
        "is_target": "false",
        "name": "Batting_average",
        "number_of_missing_values": "0"
      },
      {
        "data_type": "numeric",
        "index": "13",
        "is_ignore": "false",
        "is_row_identifier": "false",
        "is_target": "false",
        "name": "On_base_pct",
        "number_of_missing_values": "0"
      },
      {
        "data_type": "numeric",
        "index": "14",
        "is_ignore": "false",
        "is_row_identifier": "false",
        "is_target": "false",
        "name": "Slugging_pct",
        "number_of_missing_values": "0"
      },
      {
        "data_type": "numeric",
        "index": "15",
        "is_ignore": "false",
        "is_row_identifier": "false",
        "is_target": "false",
        "name": "Fielding_ave",
        "number_of_missing_values": "0"
      },
      {
        "data_type": "nominal",
        "index": "16",
        "is_ignore": "false",
        "is_row_identifier": "false",
        "is_target": "false",
        "name": "Position",
        "nominal_value": [
          "Catcher",
          "Designated_hitter",
          "First_base",
          "Outfield",
          "Second_base",
          "Shortstop",
          "Third_base"
        ],
        "number_of_missing_values": "0"
      },
      {
        "data_type": "nominal",
        "index": "17",
        "is_ignore": "false",
        "is_row_identifier": "false",
        "is_target": "false",
        "name": "Hall_of_Fame",
        "nominal_value": [
          "0",
          "1",
          "2"
        ],
        "number_of_missing_values": "0"
      }
    ]
  }
}