{
  "data_qualities": {
    "quality": [
      {
        "name": "AutoCorrelation",
        "value": "0.6616116616116616"
      },
      {
        "name": "CfsSubsetEval_DecisionStumpAUC",
        "value": "0.5"
      },
      {
        "name": "CfsSubsetEval_DecisionStumpErrRate",
        "value": "0.21519"
      },
      {
        "name": "CfsSubsetEval_DecisionStumpKappa",
        "value": "0.0"
      },
      {
        "name": "CfsSubsetEval_NaiveBayesAUC",
        "value": "0.5"
      },
      {
        "name": "CfsSubsetEval_NaiveBayesErrRate",
        "value": "0.21519"
      },
      {
        "name": "CfsSubsetEval_NaiveBayesKappa",
        "value": "0.0"
      },
      {
        "name": "CfsSubsetEval_kNN1NAUC",
        "value": "0.5"
      },
      {
        "name": "CfsSubsetEval_kNN1NErrRate",
        "value": "0.21519"
      },
      {
        "name": "CfsSubsetEval_kNN1NKappa",
        "value": "0.0"
      },
      {
        "name": "ClassEntropy",
        "value": "0.7512868130136504"
      },
      {
        "name": "DecisionStumpAUC",
        "value": "0.6836687579111858"
      },
      {
        "name": "DecisionStumpErrRate",
        "value": "0.21519"
      },
      {
        "name": "DecisionStumpKappa",
        "value": "0.0"
      },
      {
        "name": "Dimensionality",
        "value": "4.5E-5"
      },
      {
        "name": "EquivalentNumberOfAtts",
        "value": []
      },
      {
        "name": "J48.00001.AUC",
        "value": "0.74355797622052"
      },
      {
        "name": "J48.00001.ErrRate",
        "value": "0.193503"
      },
      {
        "name": "J48.00001.Kappa",
        "value": "0.3439791523037071"
      },
      {
        "name": "J48.0001.AUC",
        "value": "0.74355797622052"
      },
      {
        "name": "J48.0001.ErrRate",
        "value": "0.193503"
      },
      {
        "name": "J48.0001.Kappa",
        "value": "0.3439791523037071"
      },
      {
        "name": "J48.001.AUC",
        "value": "0.74355797622052"
      },
      {
        "name": "J48.001.ErrRate",
        "value": "0.193503"
      },
      {
        "name": "J48.001.Kappa",
        "value": "0.3439791523037071"
      },
      {
        "name": "MajorityClassPercentage",
        "value": "78.481"
      },
      {
        "name": "MajorityClassSize",
        "value": "784810.0"
      },
      {
        "name": "MaxAttributeEntropy",
        "value": []
      },
      {
        "name": "MaxKurtosisOfNumericAtts",
        "value": "5.043016818212369"
      },
      {
        "name": "MaxMeansOfNumericAtts",
        "value": "74.242410655739"
      },
      {
        "name": "MaxMutualInformation",
        "value": []
      },
      {
        "name": "MaxNominalAttDistinctValues",
        "value": "2.0"
      },
      {
        "name": "MaxSkewnessOfNumericAtts",
        "value": "-0.7404419410130751"
      },
      {
        "name": "MaxStdDevOfNumericAtts",
        "value": "14.564013786029674"
      },
      {
        "name": "MeanAttributeEntropy",
        "value": []
      },
      {
        "name": "MeanKurtosisOfNumericAtts",
        "value": "2.2988897187754085"
      },
      {
        "name": "MeanMeansOfNumericAtts",
        "value": "64.7555679257106"
      },
      {
        "name": "MeanMutualInformation",
        "value": []
      },
      {
        "name": "MeanNoiseToSignalRatio",
        "value": []
      },
      {
        "name": "MeanNominalAttDistinctValues",
        "value": "2.0"
      },
      {
        "name": "MeanSkewnessOfNumericAtts",
        "value": "-1.419108180292093"
      },
      {
        "name": "MeanStdDevOfNumericAtts",
        "value": "9.53351743653654"
      },
      {
        "name": "MinAttributeEntropy",
        "value": []
      },
      {
        "name": "MinKurtosisOfNumericAtts",
        "value": "0.5172525819753062"
      },
      {
        "name": "MinMeansOfNumericAtts",
        "value": "50.683350965223"
      },
      {
        "name": "MinMutualInformation",
        "value": []
      },
      {
        "name": "MinNominalAttDistinctValues",
        "value": "2.0"
      },
      {
        "name": "MinSkewnessOfNumericAtts",
        "value": "-2.16909457331506"
      },
      {
        "name": "MinStdDevOfNumericAtts",
        "value": "6.214597776278442"
      },
      {
        "name": "MinorityClassPercentage",
        "value": "21.519"
      },
      {
        "name": "MinorityClassSize",
        "value": "215190.0"
      },
      {
        "name": "NaiveBayesAUC",
        "value": "0.6760782667134239"
      },
      {
        "name": "NaiveBayesErrRate",
        "value": "0.398892"
      },
      {
        "name": "NaiveBayesKappa",
        "value": "0.17450508857672759"
      },
      {
        "name": "NumberOfBinaryFeatures",
        "value": "1.0"
      },
      {
        "name": "NumberOfClasses",
        "value": "2.0"
      },
      {
        "name": "NumberOfFeatures",
        "value": "45.0"
      },
      {
        "name": "NumberOfInstances",
        "value": "1000000.0"
      },
      {
        "name": "NumberOfInstancesWithMissingValues",
        "value": "0.0"
      },
      {
        "name": "NumberOfMissingValues",
        "value": "0.0"
      },
      {
        "name": "NumberOfNumericFeatures",
        "value": "44.0"
      },
      {
        "name": "NumberOfSymbolicFeatures",
        "value": "1.0"
      },
      {
        "name": "PercentageOfBinaryFeatures",
        "value": "2.2222222222222223"
      },
      {
        "name": "PercentageOfInstancesWithMissingValues",
        "value": "0.0"
      },
      {
        "name": "PercentageOfMissingValues",
        "value": "0.0"
      },
      {
        "name": "PercentageOfNumericFeatures",
        "value": "97.77777777777777"
      },
      {
        "name": "PercentageOfSymbolicFeatures",
        "value": "2.2222222222222223"
      },
      {
        "name": "Quartile1AttributeEntropy",
        "value": []
      },
      {
        "name": "Quartile1KurtosisOfNumericAtts",
        "value": "1.2505533529395132"
      },
      {
        "name": "Quartile1MeansOfNumericAtts",
        "value": "61.638390038618255"
      },
      {
        "name": "Quartile1MutualInformation",
        "value": []
      },
      {
        "name": "Quartile1SkewnessOfNumericAtts",
        "value": "-1.724100794133706"
      },
      {
        "name": "Quartile1StdDevOfNumericAtts",
        "value": "7.994965511264676"
      },
      {
        "name": "Quartile2AttributeEntropy",
        "value": []
      },
      {
        "name": "Quartile2KurtosisOfNumericAtts",
        "value": "2.1220145107648167"
      },
      {
        "name": "Quartile2MeansOfNumericAtts",
        "value": "64.7510448689175"
      },
      {
        "name": "Quartile2MutualInformation",
        "value": []
      },
      {
        "name": "Quartile2SkewnessOfNumericAtts",
        "value": "-1.3929230391200194"
      },
      {
        "name": "Quartile2StdDevOfNumericAtts",
        "value": "9.162297656832102"
      },
      {
        "name": "Quartile3AttributeEntropy",
        "value": []
      },
      {
        "name": "Quartile3KurtosisOfNumericAtts",
        "value": "3.1754435570921227"
      },
      {
        "name": "Quartile3MeansOfNumericAtts",
        "value": "67.7496936981815"
      },
      {
        "name": "Quartile3MutualInformation",
        "value": []
      },
      {
        "name": "Quartile3SkewnessOfNumericAtts",
        "value": "-1.100706962490873"
      },
      {
        "name": "Quartile3StdDevOfNumericAtts",
        "value": "10.892449342645744"
      },
      {
        "name": "REPTreeDepth1AUC",
        "value": "0.7945195284297203"
      },
      {
        "name": "REPTreeDepth1ErrRate",
        "value": "0.191404"
      },
      {
        "name": "REPTreeDepth1Kappa",
        "value": "0.3428399432062312"
      },
      {
        "name": "REPTreeDepth2AUC",
        "value": "0.7945195284297203"
      },
      {
        "name": "REPTreeDepth2ErrRate",
        "value": "0.191404"
      },
      {
        "name": "REPTreeDepth2Kappa",
        "value": "0.3428399432062312"
      },
      {
        "name": "REPTreeDepth3AUC",
        "value": "0.7945195284297203"
      },
      {
        "name": "REPTreeDepth3ErrRate",
        "value": "0.191404"
      },
      {
        "name": "REPTreeDepth3Kappa",
        "value": "0.3428399432062312"
      },
      {
        "name": "RandomTreeDepth1AUC",
        "value": "0.5736137579467991"
      },
      {
        "name": "RandomTreeDepth1ErrRate",
        "value": "0.290198"
      },
      {
        "name": "RandomTreeDepth1Kappa",
        "value": "0.14629198639565655"
      },
      {
        "name": "RandomTreeDepth2AUC",
        "value": "0.5736137579467991"
      },
      {
        "name": "RandomTreeDepth2ErrRate",
        "value": "0.290198"
      },
      {
        "name": "RandomTreeDepth2Kappa",
        "value": "0.14629198639565655"
      },
      {
        "name": "RandomTreeDepth3AUC",
        "value": "0.5736137579467991"
      },
      {
        "name": "RandomTreeDepth3ErrRate",
        "value": "0.290198"
      },
      {
        "name": "RandomTreeDepth3Kappa",
        "value": "0.14629198639565655"
      },
      {
        "name": "StdvNominalAttDistinctValues",
        "value": "0.0"
      },
      {
        "name": "kNN1NAUC",
        "value": "0.5446252675721766"
      },
      {
        "name": "kNN1NErrRate",
        "value": "0.309636"
      },
      {
        "name": "kNN1NKappa",
        "value": "0.08872117197875198"
      }
    ]
  }
}