{
  "data_set_description": {
    "default_target_attribute": "Tissue",
    "description": "**Author**:   \n**Source**: Unknown - Date unknown  \n**Please cite**:   \n\nGEMLeR provides a collection of gene expression datasets that can be used for benchmarking gene expression oriented machine learning algorithms. They can be used for estimation of different quality metrics (e.g. accuracy, precision, area under ROC curve, etc.) for classification, feature selection or clustering algorithms.\n\nThis repository was inspired by an increasing need in machine learning / bioinformatics communities for a collection of microarray classification problems that could be used by different researches. This way many different classification or feature selection techniques can finally be compared to eachother on the same set of problems.\n\nOrigin of data\n\nEach gene expression sample in GEMLeR repository comes from a large publicly available expO (Expression Project For Oncology) repository by International Genomics Consortium.\n\nThe goal of expO and its consortium supporters is to procure tissue samples under standard conditions and perform gene expression analyses on a clinically annotated set of deidentified tumor samples. The tumor data is updated with clinical outcomes and is released into the public domain without intellectual property restriction. The availability of this information translates into direct benefits for patients, researchers and pharma alike.\n\nSource: expO website\nAlthough there are various other sources of gene expression data available, a decision to use data from expO repository was made because of:\n- consistency of tissue samples processing procedure\n- same microarray platform used for all samples\n- availability of additional information for combined genotype-phenotype studies\n- availability of a large number of samples for different tumor types\n\nIn case of publishing material based on GEMLeR datasets, then, please note the assistance you received by using this repository. This will help others to obtain the same datasets and replicate your experiments. Please cite as follows when referring to this repository:\n\nStiglic, G., & Kokol, P. (2010). Stability of Ranked Gene Lists in Large Microarray Analysis Studies. Journal of biomedicine biotechnology, 2010, 616358.\n\nYou are also welcome to acknowledge the contribution of expO (Expression Project For Oncology) and International Genomics Consortium for providing their gene expression samples to the public.",
    "description_version": "1",
    "file_id": "54025",
    "format": "ARFF",
    "id": "1142",
    "ignore_attribute": "ID_REF",
    "licence": "Public",
    "md5_checksum": "f0057df5c94264c8f63113b5a4b11005",
    "minio_url": "https://data.openml.org/datasets/0000/1142/dataset_1142.pq",
    "name": "OVA_Endometrium",
    "parquet_url": "https://data.openml.org/datasets/0000/1142/dataset_1142.pq",
    "processing_date": "2020-11-20 20:30:35",
    "status": "active",
    "tag": [
      "Data Analytics",
      "Health",
      "Medicine",
      "mythbusting_1",
      "Science",
      "study_15",
      "study_20"
    ],
    "upload_date": "2014-10-07T00:54:09",
    "url": "https://api.openml.org/data/v1/download/54025/OVA_Endometrium.arff",
    "version": "1",
    "visibility": "public"
  }
}