{
  "data_features": {
    "feature": [
      {
        "data_type": "nominal",
        "index": "0",
        "is_ignore": "true",
        "is_row_identifier": "false",
        "is_target": "false",
        "name": "University",
        "nominal_value": [
          "BROWN",
          "CAL BERKELEY",
          "CAL SAN DIEGO",
          "CAL TECH",
          "CARNEGIE MELLON",
          "CASE WESTERN",
          "CATHOLIC UNIV.",
          "CLARK",
          "COLORADO",
          "COLUMBIA",
          "CORNELL",
          "DUKE",
          "HARVARD",
          "ILLINOIS",
          "INDIANA",
          "IOWA STATE",
          "JOHN HOPKINS",
          "KANSAS",
          "M.I.T.",
          "MARYLAND",
          "MICHIGAN",
          "MICHIGAN STATE",
          "MINNESOTA",
          "MISSOURI",
          "N.Y.U.",
          "NEBRASKA",
          "NORTH CAROLINA",
          "NORTHWESTERN",
          "OHIO STATE",
          "OREGON",
          "PENN STATE",
          "PITTSBURGH",
          "PRINCETON",
          "PURDUE",
          "ROCHESTER",
          "STANFORD",
          "SYRACUSE",
          "TEXAS",
          "TULANE",
          "U.C.L.A.",
          "U.S.C.",
          "UNIV. OF CHICAGO",
          "UNIV. OF IOWA",
          "UNIV. OF PENN.",
          "UNIV. OF WASHINGTON",
          "VANDERBILT",
          "VIRGINIA",
          "WASHINGTON UNIV.",
          "WISCONSIN",
          "YALE"
        ],
        "number_of_missing_values": "0"
      },
      {
        "data_type": "numeric",
        "index": "1",
        "is_ignore": "false",
        "is_row_identifier": "false",
        "is_target": "false",
        "name": "CIC.institutions",
        "number_of_missing_values": "0"
      },
      {
        "data_type": "numeric",
        "index": "2",
        "is_ignore": "false",
        "is_row_identifier": "false",
        "is_target": "false",
        "name": "average.salary",
        "number_of_missing_values": "0"
      },
      {
        "data_type": "numeric",
        "index": "3",
        "is_ignore": "false",
        "is_row_identifier": "false",
        "is_target": "false",
        "name": "full.prof.salary",
        "number_of_missing_values": "0"
      },
      {
        "data_type": "numeric",
        "index": "4",
        "is_ignore": "false",
        "is_row_identifier": "false",
        "is_target": "false",
        "name": "assoc.prof.salary",
        "number_of_missing_values": "0"
      },
      {
        "data_type": "numeric",
        "index": "5",
        "is_ignore": "false",
        "is_row_identifier": "false",
        "is_target": "true",
        "name": "asst.prof.salary",
        "number_of_missing_values": "0"
      }
    ]
  }
}