{
  "data_qualities": {
    "quality": [
      {
        "name": "AutoCorrelation",
        "value": "0.4326923076923077"
      },
      {
        "name": "CfsSubsetEval_DecisionStumpAUC",
        "value": "0.5490757874344501"
      },
      {
        "name": "CfsSubsetEval_DecisionStumpErrRate",
        "value": "0.5047619047619047"
      },
      {
        "name": "CfsSubsetEval_DecisionStumpKappa",
        "value": "0.10429744084983106"
      },
      {
        "name": "CfsSubsetEval_NaiveBayesAUC",
        "value": "0.5490757874344501"
      },
      {
        "name": "CfsSubsetEval_NaiveBayesErrRate",
        "value": "0.5047619047619047"
      },
      {
        "name": "CfsSubsetEval_NaiveBayesKappa",
        "value": "0.10429744084983106"
      },
      {
        "name": "CfsSubsetEval_kNN1NAUC",
        "value": "0.5490757874344501"
      },
      {
        "name": "CfsSubsetEval_kNN1NErrRate",
        "value": "0.5047619047619047"
      },
      {
        "name": "CfsSubsetEval_kNN1NKappa",
        "value": "0.10429744084983106"
      },
      {
        "name": "ClassEntropy",
        "value": "1.2638502227394854"
      },
      {
        "name": "DecisionStumpAUC",
        "value": "0.5893536540171365"
      },
      {
        "name": "DecisionStumpErrRate",
        "value": "0.44761904761904764"
      },
      {
        "name": "DecisionStumpKappa",
        "value": "0.133754607688257"
      },
      {
        "name": "Dimensionality",
        "value": "212.22857142857143"
      },
      {
        "name": "EquivalentNumberOfAtts",
        "value": []
      },
      {
        "name": "J48.00001.AUC",
        "value": "0.57738568422459"
      },
      {
        "name": "J48.00001.ErrRate",
        "value": "0.45714285714285713"
      },
      {
        "name": "J48.00001.Kappa",
        "value": "0.17687408133267998"
      },
      {
        "name": "J48.0001.AUC",
        "value": "0.57738568422459"
      },
      {
        "name": "J48.0001.ErrRate",
        "value": "0.45714285714285713"
      },
      {
        "name": "J48.0001.Kappa",
        "value": "0.17687408133267998"
      },
      {
        "name": "J48.001.AUC",
        "value": "0.57738568422459"
      },
      {
        "name": "J48.001.ErrRate",
        "value": "0.45714285714285713"
      },
      {
        "name": "J48.001.Kappa",
        "value": "0.17687408133267998"
      },
      {
        "name": "MajorityClassPercentage",
        "value": "55.23809523809524"
      },
      {
        "name": "MajorityClassSize",
        "value": "58.0"
      },
      {
        "name": "MaxAttributeEntropy",
        "value": []
      },
      {
        "name": "MaxKurtosisOfNumericAtts",
        "value": "93.37393470257864"
      },
      {
        "name": "MaxMeansOfNumericAtts",
        "value": "7.951819047619048"
      },
      {
        "name": "MaxMutualInformation",
        "value": []
      },
      {
        "name": "MaxNominalAttDistinctValues",
        "value": "3.0"
      },
      {
        "name": "MaxSkewnessOfNumericAtts",
        "value": "9.404957706382348"
      },
      {
        "name": "MaxStdDevOfNumericAtts",
        "value": "1.0722482373968878"
      },
      {
        "name": "MeanAttributeEntropy",
        "value": []
      },
      {
        "name": "MeanKurtosisOfNumericAtts",
        "value": "2.0892267889121645"
      },
      {
        "name": "MeanMeansOfNumericAtts",
        "value": "3.6661217173886564"
      },
      {
        "name": "MeanMutualInformation",
        "value": []
      },
      {
        "name": "MeanNoiseToSignalRatio",
        "value": []
      },
      {
        "name": "MeanNominalAttDistinctValues",
        "value": "3.0"
      },
      {
        "name": "MeanSkewnessOfNumericAtts",
        "value": "0.3910461112198567"
      },
      {
        "name": "MeanStdDevOfNumericAtts",
        "value": "0.1616880517282856"
      },
      {
        "name": "MinAttributeEntropy",
        "value": []
      },
      {
        "name": "MinKurtosisOfNumericAtts",
        "value": "-1.1584274518951208"
      },
      {
        "name": "MinMeansOfNumericAtts",
        "value": "1.863704761904762"
      },
      {
        "name": "MinMutualInformation",
        "value": []
      },
      {
        "name": "MinNominalAttDistinctValues",
        "value": "3.0"
      },
      {
        "name": "MinSkewnessOfNumericAtts",
        "value": "-8.178639341410578"
      },
      {
        "name": "MinStdDevOfNumericAtts",
        "value": "0.03955240646462432"
      },
      {
        "name": "MinorityClassPercentage",
        "value": "6.666666666666667"
      },
      {
        "name": "MinorityClassSize",
        "value": "7.0"
      },
      {
        "name": "NaiveBayesAUC",
        "value": "0.5943122126100849"
      },
      {
        "name": "NaiveBayesErrRate",
        "value": "0.4380952380952381"
      },
      {
        "name": "NaiveBayesKappa",
        "value": "0.17982679572083546"
      },
      {
        "name": "NumberOfBinaryFeatures",
        "value": "0.0"
      },
      {
        "name": "NumberOfClasses",
        "value": "3.0"
      },
      {
        "name": "NumberOfFeatures",
        "value": "22284.0"
      },
      {
        "name": "NumberOfInstances",
        "value": "105.0"
      },
      {
        "name": "NumberOfInstancesWithMissingValues",
        "value": "0.0"
      },
      {
        "name": "NumberOfMissingValues",
        "value": "0.0"
      },
      {
        "name": "NumberOfNumericFeatures",
        "value": "22283.0"
      },
      {
        "name": "NumberOfSymbolicFeatures",
        "value": "1.0"
      },
      {
        "name": "PercentageOfBinaryFeatures",
        "value": "0.0"
      },
      {
        "name": "PercentageOfInstancesWithMissingValues",
        "value": "0.0"
      },
      {
        "name": "PercentageOfMissingValues",
        "value": "0.0"
      },
      {
        "name": "PercentageOfNumericFeatures",
        "value": "99.99551247531862"
      },
      {
        "name": "PercentageOfSymbolicFeatures",
        "value": "0.004487524681385748"
      },
      {
        "name": "Quartile1AttributeEntropy",
        "value": []
      },
      {
        "name": "Quartile1KurtosisOfNumericAtts",
        "value": "0.28796568697384073"
      },
      {
        "name": "Quartile1MeansOfNumericAtts",
        "value": "2.931104761904762"
      },
      {
        "name": "Quartile1MutualInformation",
        "value": []
      },
      {
        "name": "Quartile1SkewnessOfNumericAtts",
        "value": "-0.08631056698343131"
      },
      {
        "name": "Quartile1StdDevOfNumericAtts",
        "value": "0.10811196627916474"
      },
      {
        "name": "Quartile2AttributeEntropy",
        "value": []
      },
      {
        "name": "Quartile2KurtosisOfNumericAtts",
        "value": "0.9737073802317004"
      },
      {
        "name": "Quartile2MeansOfNumericAtts",
        "value": "3.618152380952381"
      },
      {
        "name": "Quartile2MutualInformation",
        "value": []
      },
      {
        "name": "Quartile2SkewnessOfNumericAtts",
        "value": "0.32558217655413274"
      },
      {
        "name": "Quartile2StdDevOfNumericAtts",
        "value": "0.13884808548370714"
      },
      {
        "name": "Quartile3AttributeEntropy",
        "value": []
      },
      {
        "name": "Quartile3KurtosisOfNumericAtts",
        "value": "2.249279241555451"
      },
      {
        "name": "Quartile3MeansOfNumericAtts",
        "value": "4.263409523809524"
      },
      {
        "name": "Quartile3MutualInformation",
        "value": []
      },
      {
        "name": "Quartile3SkewnessOfNumericAtts",
        "value": "0.7686193009500174"
      },
      {
        "name": "Quartile3StdDevOfNumericAtts",
        "value": "0.18967045935037738"
      },
      {
        "name": "REPTreeDepth1AUC",
        "value": "0.48028768018781043"
      },
      {
        "name": "REPTreeDepth1ErrRate",
        "value": "0.49523809523809526"
      },
      {
        "name": "REPTreeDepth1Kappa",
        "value": "-0.03467879476975557"
      },
      {
        "name": "REPTreeDepth2AUC",
        "value": "0.48028768018781043"
      },
      {
        "name": "REPTreeDepth2ErrRate",
        "value": "0.49523809523809526"
      },
      {
        "name": "REPTreeDepth2Kappa",
        "value": "-0.03467879476975557"
      },
      {
        "name": "REPTreeDepth3AUC",
        "value": "0.48028768018781043"
      },
      {
        "name": "REPTreeDepth3ErrRate",
        "value": "0.49523809523809526"
      },
      {
        "name": "REPTreeDepth3Kappa",
        "value": "-0.03467879476975557"
      },
      {
        "name": "RandomTreeDepth1AUC",
        "value": "0.4495056615117406"
      },
      {
        "name": "RandomTreeDepth1ErrRate",
        "value": "0.6"
      },
      {
        "name": "RandomTreeDepth1Kappa",
        "value": "-0.10470941883767532"
      },
      {
        "name": "RandomTreeDepth2AUC",
        "value": "0.4495056615117406"
      },
      {
        "name": "RandomTreeDepth2ErrRate",
        "value": "0.6"
      },
      {
        "name": "RandomTreeDepth2Kappa",
        "value": "-0.10470941883767532"
      },
      {
        "name": "RandomTreeDepth3AUC",
        "value": "0.4495056615117406"
      },
      {
        "name": "RandomTreeDepth3ErrRate",
        "value": "0.6"
      },
      {
        "name": "RandomTreeDepth3Kappa",
        "value": "-0.10470941883767532"
      },
      {
        "name": "StdvNominalAttDistinctValues",
        "value": "0.0"
      },
      {
        "name": "kNN1NAUC",
        "value": "0.5696341767944025"
      },
      {
        "name": "kNN1NErrRate",
        "value": "0.42857142857142855"
      },
      {
        "name": "kNN1NKappa",
        "value": "0.23765730880929328"
      }
    ]
  }
}