{
  "data_set_description": {
    "default_target_attribute": "Language",
    "description": "**Author**:   \n**Source**: Unknown - Date unknown  \n**Please cite**:   \n\n%%%%%%%%%%%%%%%%%%%%%%%%%%%%%%%%%%%%%%%%%%%%%%%%%%%%%%%%%%%%%%%%%%%%%%%%%\nThis is a PROMISE Software Engineering Repository data set made publicly\navailable in order to encourage repeatable, verifiable, refutable, and/or\nimprovable predictive models of software engineering.\n\nIf you publish material based on PROMISE data sets then, please\nfollow the acknowledgment guidelines posted on the PROMISE repository\nweb page http://promise.site.uottawa.ca/SERepository .\n%%%%%%%%%%%%%%%%%%%%%%%%%%%%%%%%%%%%%%%%%%%%%%%%%%%%%%%%%%%%%%%%%%%%%%%%\nDomain: software cost estimation\nDonor:  Martin Shepperd <Martin.Shepperd@brunel.ac.uk>\nCorrections by: Dan Port <dport@hawaii.edu> with information from Barbara Kitchenham <barbara@cs.keele.ac.uk>\n\nNotes:  4 incomplete projects (projects 38,44,66,75) so often people use the 77 complete cases.\nThe original source is [1].\nOur paper [2] provides a basic overview of the data set.\nReferences:\n[1] J. M. Desharnais, \"Analyse statistique de la\nproductivitie des projets informatique a partie de la\ntechnique des point des fonction,\" University of Montreal,\nMasters Thesis, 1989.\n\n[2] M. J. Shepperd and C. Schofield, \"Estimating software\nproject effort using analogies,\" IEEE Transactions on\nSoftware Engineering, vol. 23, pp. 736-743, 1997.\n\n[3] Dreger, J. Brian. \"Function Point Analysis\"\nEnglewood Cliffs, NJ: Prentice Hall, 1989.\n\nAttributes:\n\n\nNote: Many of the above attributes are numerically coded catagorical variables. Values of -1 indicate missing data,\n\nSample run (WEKA):\n=== Run information ===\n\nScheme:       weka.classifiers.functions.LinearRegression -S 0 -R 1.0E-8\nRelation:     martin.csv\nInstances:    81\nAttributes:   12\nProject\nTeamExp\nManagerExp\nYearEnd\nLength\nEffort\nTransactions\nEntities\nPointsNonAdjust\nAdjustment\nPointsAjust\nLangage\n\nNote from dport: the regression model below is problematic in that it treats catagorical variables as continuous values\nand it includes the dependent variable Length as an independent variable which is likely a mistake.\n\nTest mode:    10-fold cross-validation\n\n=== Classifier model (full training set) ===\n\nLinear Regression Model\n\nEffort =\n-433.25   * TeamExp +\n408.8057 * ManagerExp +\n201.2701 * Length +\n4.2361 * Transactions +\n7.9056 * Entities +\n4.4594 * PointsAdjust +\n92.1389 * Adjustment +\n-1777.4579 * Langage +\n-278.0786\n\nTime taken to build model: 0.02 seconds\n\n=== Cross-validation ===\n=== Summary ===\n\nCorrelation coefficient                  0.7303\nMean absolute error                   2082.1182\nRoot mean squared error               3007.0504\nRelative absolute error                 64.9965 %\nRoot relative squared error             67.3788 %\nTotal Number of Instances               81",
    "description_version": "1",
    "file_id": "53957",
    "format": "ARFF",
    "id": "1074",
    "licence": "Public",
    "md5_checksum": "61d1a897fb2b17176d1d1a418b98d467",
    "minio_url": "https://data.openml.org/datasets/0000/1074/dataset_1074.pq",
    "name": "desharnais",
    "parquet_url": "https://data.openml.org/datasets/0000/1074/dataset_1074.pq",
    "processing_date": "2021-09-16 17:27:50",
    "status": "deactivated",
    "tag": [
      "invalid_ARFF",
      "study_1",
      "study_41"
    ],
    "upload_date": "2014-10-06T23:57:55",
    "url": "https://api.openml.org/data/v1/download/53957/desharnais.arff",
    "version": "1",
    "visibility": "public"
  }
}