{
  "data_set_description": {
    "citation": "Sayyad Shirabad, J. and Menzies, T.J. (2005) The PROMISE Repository of Software Engineering Databases. School of Information Technology and Engineering, University of Ottawa, Canada.",
    "collection_date": "2004",
    "creator": "Mike Chapman",
    "default_target_attribute": "c",
    "description": "**Author**: Mike Chapman, NASA  \n**Source**: [tera-PROMISE](http://openscience.us/repo/defect/mccabehalsted/pc3.html) - 2004  \n**Please cite**: Sayyad Shirabad, J. and Menzies, T.J. (2005) The PROMISE Repository of Software Engineering Databases. School of Information Technology and Engineering, University of Ottawa, Canada.  \n  \n**PC3 Software defect prediction**  \nOne of the NASA Metrics Data Program defect data sets. Data from flight software for earth orbiting satellite. Data comes from McCabe and Halstead features extractors of source code.  These features were defined in the 70s in an attempt to objectively characterize code features that are associated with software quality.\n\n### Relevant papers  \n\n- Shepperd, M. and Qinbao Song and Zhongbin Sun and Mair, C. (2013)\nData Quality: Some Comments on the NASA Software Defect Datasets, IEEE Transactions on Software Engineering, 39.\n\n- Tim Menzies and Justin S. Di Stefano (2004) How Good is Your Blind Spot Sampling Policy? 2004 IEEE Conference on High Assurance\nSoftware Engineering.\n\n- T. Menzies and J. DiStefano and A. Orrego and R. Chapman (2004) Assessing Predictors of Software Defects\", Workshop on Predictive Software Models, Chicago",
    "description_version": "1",
    "file_id": "53933",
    "format": "ARFF",
    "id": "1050",
    "language": "English",
    "licence": "Public",
    "md5_checksum": "a93c30f6c357d3ee74bccb247b10ef68",
    "minio_url": "https://data.openml.org/datasets/0000/1050/dataset_1050.pq",
    "name": "pc3",
    "original_data_url": "http://openscience.us/repo/defect/mccabehalsted/pc3.html",
    "paper_url": "https://ieeexplore.ieee.org/abstract/document/6464273",
    "parquet_url": "https://data.openml.org/datasets/0000/1050/dataset_1050.pq",
    "processing_date": "2020-11-20 20:42:25",
    "status": "active",
    "tag": [
      "Computer Science",
      "Data Science",
      "Engineering",
      "mythbusting_1",
      "OpenML-CC18",
      "OpenML100",
      "PROMISE",
      "study_1",
      "study_123",
      "study_14",
      "study_15",
      "study_20",
      "study_34",
      "study_41",
      "study_52",
      "study_7",
      "study_98",
      "study_99"
    ],
    "upload_date": "2014-10-06T23:57:13",
    "url": "https://api.openml.org/data/v1/download/53933/pc3.arff",
    "version": "1",
    "visibility": "public"
  }
}