{
  "data_qualities": {
    "quality": [
      {
        "name": "AutoCorrelation",
        "value": "0.6558441558441559"
      },
      {
        "name": "CfsSubsetEval_DecisionStumpAUC",
        "value": "0.6357335386984982"
      },
      {
        "name": "CfsSubsetEval_DecisionStumpErrRate",
        "value": "0.2967741935483871"
      },
      {
        "name": "CfsSubsetEval_DecisionStumpKappa",
        "value": "0.14467370441458727"
      },
      {
        "name": "CfsSubsetEval_NaiveBayesAUC",
        "value": "0.6357335386984982"
      },
      {
        "name": "CfsSubsetEval_NaiveBayesErrRate",
        "value": "0.2967741935483871"
      },
      {
        "name": "CfsSubsetEval_NaiveBayesKappa",
        "value": "0.14467370441458727"
      },
      {
        "name": "CfsSubsetEval_kNN1NAUC",
        "value": "0.6357335386984982"
      },
      {
        "name": "CfsSubsetEval_kNN1NErrRate",
        "value": "0.2967741935483871"
      },
      {
        "name": "CfsSubsetEval_kNN1NKappa",
        "value": "0.14467370441458727"
      },
      {
        "name": "ClassEntropy",
        "value": "0.9001221436913709"
      },
      {
        "name": "DecisionStumpAUC",
        "value": "0.629283788987293"
      },
      {
        "name": "DecisionStumpErrRate",
        "value": "0.2967741935483871"
      },
      {
        "name": "DecisionStumpKappa",
        "value": "0.14467370441458727"
      },
      {
        "name": "Dimensionality",
        "value": "0.05806451612903226"
      },
      {
        "name": "EquivalentNumberOfAtts",
        "value": "6.397516991247445"
      },
      {
        "name": "J48.00001.AUC",
        "value": "0.7359453215248363"
      },
      {
        "name": "J48.00001.ErrRate",
        "value": "0.3161290322580645"
      },
      {
        "name": "J48.00001.Kappa",
        "value": "0.23966362999299215"
      },
      {
        "name": "J48.0001.AUC",
        "value": "0.7359453215248363"
      },
      {
        "name": "J48.0001.ErrRate",
        "value": "0.3161290322580645"
      },
      {
        "name": "J48.0001.Kappa",
        "value": "0.23966362999299215"
      },
      {
        "name": "J48.001.AUC",
        "value": "0.7359453215248363"
      },
      {
        "name": "J48.001.ErrRate",
        "value": "0.3161290322580645"
      },
      {
        "name": "J48.001.Kappa",
        "value": "0.23966362999299215"
      },
      {
        "name": "MajorityClassPercentage",
        "value": "68.38709677419355"
      },
      {
        "name": "MajorityClassSize",
        "value": "106.0"
      },
      {
        "name": "MaxAttributeEntropy",
        "value": "4.309701976417481"
      },
      {
        "name": "MaxKurtosisOfNumericAtts",
        "value": "-0.2910582458315223"
      },
      {
        "name": "MaxMeansOfNumericAtts",
        "value": "5.335483870967742"
      },
      {
        "name": "MaxMutualInformation",
        "value": "0.25131494347442"
      },
      {
        "name": "MaxNominalAttDistinctValues",
        "value": "21.0"
      },
      {
        "name": "MaxSkewnessOfNumericAtts",
        "value": "0.5448411693930997"
      },
      {
        "name": "MaxStdDevOfNumericAtts",
        "value": "3.106920259374996"
      },
      {
        "name": "MeanAttributeEntropy",
        "value": "2.408958285460666"
      },
      {
        "name": "MeanKurtosisOfNumericAtts",
        "value": "-0.7860425273173975"
      },
      {
        "name": "MeanMeansOfNumericAtts",
        "value": "3.758064516129033"
      },
      {
        "name": "MeanMutualInformation",
        "value": "0.14069867183203166"
      },
      {
        "name": "MeanNoiseToSignalRatio",
        "value": "16.121400323782154"
      },
      {
        "name": "MeanNominalAttDistinctValues",
        "value": "6.857142857142857"
      },
      {
        "name": "MeanSkewnessOfNumericAtts",
        "value": "0.3805582497935957"
      },
      {
        "name": "MeanStdDevOfNumericAtts",
        "value": "2.0863734889803363"
      },
      {
        "name": "MinAttributeEntropy",
        "value": "0.9358300617388258"
      },
      {
        "name": "MinKurtosisOfNumericAtts",
        "value": "-1.2810268088032728"
      },
      {
        "name": "MinMeansOfNumericAtts",
        "value": "2.180645161290323"
      },
      {
        "name": "MinMutualInformation",
        "value": "0.03391827128551"
      },
      {
        "name": "MinNominalAttDistinctValues",
        "value": "2.0"
      },
      {
        "name": "MinSkewnessOfNumericAtts",
        "value": "0.2162753301940917"
      },
      {
        "name": "MinStdDevOfNumericAtts",
        "value": "1.0658267185856762"
      },
      {
        "name": "MinorityClassPercentage",
        "value": "31.61290322580645"
      },
      {
        "name": "MinorityClassSize",
        "value": "49.0"
      },
      {
        "name": "NaiveBayesAUC",
        "value": "0.8219098960338853"
      },
      {
        "name": "NaiveBayesErrRate",
        "value": "0.21935483870967742"
      },
      {
        "name": "NaiveBayesKappa",
        "value": "0.5140169679085209"
      },
      {
        "name": "NumberOfBinaryFeatures",
        "value": "1.0"
      },
      {
        "name": "NumberOfClasses",
        "value": "2.0"
      },
      {
        "name": "NumberOfFeatures",
        "value": "9.0"
      },
      {
        "name": "NumberOfInstances",
        "value": "155.0"
      },
      {
        "name": "NumberOfInstancesWithMissingValues",
        "value": "0.0"
      },
      {
        "name": "NumberOfMissingValues",
        "value": "0.0"
      },
      {
        "name": "NumberOfNumericFeatures",
        "value": "2.0"
      },
      {
        "name": "NumberOfSymbolicFeatures",
        "value": "7.0"
      },
      {
        "name": "PercentageOfBinaryFeatures",
        "value": "11.11111111111111"
      },
      {
        "name": "PercentageOfInstancesWithMissingValues",
        "value": "0.0"
      },
      {
        "name": "PercentageOfMissingValues",
        "value": "0.0"
      },
      {
        "name": "PercentageOfNumericFeatures",
        "value": "22.22222222222222"
      },
      {
        "name": "PercentageOfSymbolicFeatures",
        "value": "77.77777777777779"
      },
      {
        "name": "Quartile1AttributeEntropy",
        "value": "1.3864327768434617"
      },
      {
        "name": "Quartile1KurtosisOfNumericAtts",
        "value": "-1.2810268088032728"
      },
      {
        "name": "Quartile1MeansOfNumericAtts",
        "value": "2.180645161290323"
      },
      {
        "name": "Quartile1MutualInformation",
        "value": "0.0817758624549175"
      },
      {
        "name": "Quartile1SkewnessOfNumericAtts",
        "value": "0.2162753301940917"
      },
      {
        "name": "Quartile1StdDevOfNumericAtts",
        "value": "1.0658267185856762"
      },
      {
        "name": "Quartile2AttributeEntropy",
        "value": "2.444132850545177"
      },
      {
        "name": "Quartile2KurtosisOfNumericAtts",
        "value": "-0.7860425273173975"
      },
      {
        "name": "Quartile2MeansOfNumericAtts",
        "value": "3.758064516129033"
      },
      {
        "name": "Quartile2MutualInformation",
        "value": "0.13558814403447"
      },
      {
        "name": "Quartile2SkewnessOfNumericAtts",
        "value": "0.38055824979359565"
      },
      {
        "name": "Quartile2StdDevOfNumericAtts",
        "value": "2.0863734889803363"
      },
      {
        "name": "Quartile3AttributeEntropy",
        "value": "3.1649142128336156"
      },
      {
        "name": "Quartile3KurtosisOfNumericAtts",
        "value": "-0.2910582458315223"
      },
      {
        "name": "Quartile3MeansOfNumericAtts",
        "value": "5.335483870967742"
      },
      {
        "name": "Quartile3MutualInformation",
        "value": "0.205369337357555"
      },
      {
        "name": "Quartile3SkewnessOfNumericAtts",
        "value": "0.5448411693930997"
      },
      {
        "name": "Quartile3StdDevOfNumericAtts",
        "value": "3.106920259374996"
      },
      {
        "name": "REPTreeDepth1AUC",
        "value": "0.4948979591836735"
      },
      {
        "name": "REPTreeDepth1ErrRate",
        "value": "0.3161290322580645"
      },
      {
        "name": "REPTreeDepth1Kappa",
        "value": "0.0"
      },
      {
        "name": "REPTreeDepth2AUC",
        "value": "0.4948979591836735"
      },
      {
        "name": "REPTreeDepth2ErrRate",
        "value": "0.3161290322580645"
      },
      {
        "name": "REPTreeDepth2Kappa",
        "value": "0.0"
      },
      {
        "name": "REPTreeDepth3AUC",
        "value": "0.4948979591836735"
      },
      {
        "name": "REPTreeDepth3ErrRate",
        "value": "0.3161290322580645"
      },
      {
        "name": "REPTreeDepth3Kappa",
        "value": "0.0"
      },
      {
        "name": "RandomTreeDepth1AUC",
        "value": "0.6594147092799383"
      },
      {
        "name": "RandomTreeDepth1ErrRate",
        "value": "0.3161290322580645"
      },
      {
        "name": "RandomTreeDepth1Kappa",
        "value": "0.28839126768481205"
      },
      {
        "name": "RandomTreeDepth2AUC",
        "value": "0.6594147092799383"
      },
      {
        "name": "RandomTreeDepth2ErrRate",
        "value": "0.3161290322580645"
      },
      {
        "name": "RandomTreeDepth2Kappa",
        "value": "0.28839126768481205"
      },
      {
        "name": "RandomTreeDepth3AUC",
        "value": "0.6594147092799383"
      },
      {
        "name": "RandomTreeDepth3ErrRate",
        "value": "0.3161290322580645"
      },
      {
        "name": "RandomTreeDepth3Kappa",
        "value": "0.28839126768481205"
      },
      {
        "name": "StdvNominalAttDistinctValues",
        "value": "6.51737604225738"
      },
      {
        "name": "kNN1NAUC",
        "value": "0.610512129380054"
      },
      {
        "name": "kNN1NErrRate",
        "value": "0.34838709677419355"
      },
      {
        "name": "kNN1NKappa",
        "value": "0.21994408201304752"
      }
    ]
  }
}