{
  "data_qualities": {
    "quality": [
      {
        "name": "AutoCorrelation",
        "value": "0.8828581871345029"
      },
      {
        "name": "CfsSubsetEval_DecisionStumpAUC",
        "value": "0.9355147422290716"
      },
      {
        "name": "CfsSubsetEval_DecisionStumpErrRate",
        "value": "0.03160972044582496"
      },
      {
        "name": "CfsSubsetEval_DecisionStumpKappa",
        "value": "0.8253035645062696"
      },
      {
        "name": "CfsSubsetEval_NaiveBayesAUC",
        "value": "0.9355147422290716"
      },
      {
        "name": "CfsSubsetEval_NaiveBayesErrRate",
        "value": "0.03160972044582496"
      },
      {
        "name": "CfsSubsetEval_NaiveBayesKappa",
        "value": "0.8253035645062696"
      },
      {
        "name": "CfsSubsetEval_kNN1NAUC",
        "value": "0.9355147422290716"
      },
      {
        "name": "CfsSubsetEval_kNN1NErrRate",
        "value": "0.03160972044582496"
      },
      {
        "name": "CfsSubsetEval_kNN1NKappa",
        "value": "0.8253035645062696"
      },
      {
        "name": "ClassEntropy",
        "value": "0.4763084842226657"
      },
      {
        "name": "DecisionStumpAUC",
        "value": "0.8369358989270449"
      },
      {
        "name": "DecisionStumpErrRate",
        "value": "0.10232048236798831"
      },
      {
        "name": "DecisionStumpKappa",
        "value": "0.0"
      },
      {
        "name": "Dimensionality",
        "value": "0.0020098666179426275"
      },
      {
        "name": "EquivalentNumberOfAtts",
        "value": []
      },
      {
        "name": "J48.00001.AUC",
        "value": "0.946854191503591"
      },
      {
        "name": "J48.00001.ErrRate",
        "value": "0.027041841768682625"
      },
      {
        "name": "J48.00001.Kappa",
        "value": "0.8501877452701175"
      },
      {
        "name": "J48.0001.AUC",
        "value": "0.946854191503591"
      },
      {
        "name": "J48.0001.ErrRate",
        "value": "0.027041841768682625"
      },
      {
        "name": "J48.0001.Kappa",
        "value": "0.8501877452701175"
      },
      {
        "name": "J48.001.AUC",
        "value": "0.946854191503591"
      },
      {
        "name": "J48.001.ErrRate",
        "value": "0.027041841768682625"
      },
      {
        "name": "J48.001.Kappa",
        "value": "0.8501877452701175"
      },
      {
        "name": "MajorityClassPercentage",
        "value": "89.76795176320117"
      },
      {
        "name": "MajorityClassSize",
        "value": "4913.0"
      },
      {
        "name": "MaxAttributeEntropy",
        "value": []
      },
      {
        "name": "MaxKurtosisOfNumericAtts",
        "value": "4816.887814668214"
      },
      {
        "name": "MaxMeansOfNumericAtts",
        "value": "1198.4056276265449"
      },
      {
        "name": "MaxMutualInformation",
        "value": []
      },
      {
        "name": "MaxNominalAttDistinctValues",
        "value": "2.0"
      },
      {
        "name": "MaxSkewnessOfNumericAtts",
        "value": "67.42540616199001"
      },
      {
        "name": "MaxStdDevOfNumericAtts",
        "value": "4849.37695008372"
      },
      {
        "name": "MeanAttributeEntropy",
        "value": []
      },
      {
        "name": "MeanKurtosisOfNumericAtts",
        "value": "652.829669012381"
      },
      {
        "name": "MeanMeansOfNumericAtts",
        "value": "253.3275863146391"
      },
      {
        "name": "MeanMutualInformation",
        "value": []
      },
      {
        "name": "MeanNoiseToSignalRatio",
        "value": []
      },
      {
        "name": "MeanNominalAttDistinctValues",
        "value": "2.0"
      },
      {
        "name": "MeanSkewnessOfNumericAtts",
        "value": "14.71145196752045"
      },
      {
        "name": "MeanStdDevOfNumericAtts",
        "value": "840.2336192978349"
      },
      {
        "name": "MinAttributeEntropy",
        "value": []
      },
      {
        "name": "MinKurtosisOfNumericAtts",
        "value": "0.6919281142973475"
      },
      {
        "name": "MinMeansOfNumericAtts",
        "value": "0.3686424264571532"
      },
      {
        "name": "MinMutualInformation",
        "value": []
      },
      {
        "name": "MinNominalAttDistinctValues",
        "value": "2.0"
      },
      {
        "name": "MinSkewnessOfNumericAtts",
        "value": "-0.8347174977898819"
      },
      {
        "name": "MinStdDevOfNumericAtts",
        "value": "0.17066127880753776"
      },
      {
        "name": "MinorityClassPercentage",
        "value": "10.232048236798832"
      },
      {
        "name": "MinorityClassSize",
        "value": "560.0"
      },
      {
        "name": "NaiveBayesAUC",
        "value": "0.9177409268974023"
      },
      {
        "name": "NaiveBayesErrRate",
        "value": "0.10049333089713137"
      },
      {
        "name": "NaiveBayesKappa",
        "value": "0.42854273508978996"
      },
      {
        "name": "NumberOfBinaryFeatures",
        "value": "1.0"
      },
      {
        "name": "NumberOfClasses",
        "value": "2.0"
      },
      {
        "name": "NumberOfFeatures",
        "value": "11.0"
      },
      {
        "name": "NumberOfInstances",
        "value": "5473.0"
      },
      {
        "name": "NumberOfInstancesWithMissingValues",
        "value": "0.0"
      },
      {
        "name": "NumberOfMissingValues",
        "value": "0.0"
      },
      {
        "name": "NumberOfNumericFeatures",
        "value": "10.0"
      },
      {
        "name": "NumberOfSymbolicFeatures",
        "value": "1.0"
      },
      {
        "name": "PercentageOfBinaryFeatures",
        "value": "9.090909090909092"
      },
      {
        "name": "PercentageOfInstancesWithMissingValues",
        "value": "0.0"
      },
      {
        "name": "PercentageOfMissingValues",
        "value": "0.0"
      },
      {
        "name": "PercentageOfNumericFeatures",
        "value": "90.9090909090909"
      },
      {
        "name": "PercentageOfSymbolicFeatures",
        "value": "9.090909090909092"
      },
      {
        "name": "Quartile1AttributeEntropy",
        "value": []
      },
      {
        "name": "Quartile1KurtosisOfNumericAtts",
        "value": "3.9906582106794564"
      },
      {
        "name": "Quartile1MeansOfNumericAtts",
        "value": "4.86072186186736"
      },
      {
        "name": "Quartile1MutualInformation",
        "value": []
      },
      {
        "name": "Quartile1SkewnessOfNumericAtts",
        "value": "1.985556904427686"
      },
      {
        "name": "Quartile1StdDevOfNumericAtts",
        "value": "14.264862124545102"
      },
      {
        "name": "Quartile2AttributeEntropy",
        "value": []
      },
      {
        "name": "Quartile2KurtosisOfNumericAtts",
        "value": "123.98823394304979"
      },
      {
        "name": "Quartile2MeansOfNumericAtts",
        "value": "51.661110542664645"
      },
      {
        "name": "Quartile2MutualInformation",
        "value": []
      },
      {
        "name": "Quartile2SkewnessOfNumericAtts",
        "value": "8.931144052030959"
      },
      {
        "name": "Quartile2StdDevOfNumericAtts",
        "value": "91.9003890650624"
      },
      {
        "name": "Quartile3AttributeEntropy",
        "value": []
      },
      {
        "name": "Quartile3KurtosisOfNumericAtts",
        "value": "528.4812332352154"
      },
      {
        "name": "Quartile3MeansOfNumericAtts",
        "value": "459.7251050612191"
      },
      {
        "name": "Quartile3MutualInformation",
        "value": []
      },
      {
        "name": "Quartile3SkewnessOfNumericAtts",
        "value": "19.73532770124508"
      },
      {
        "name": "Quartile3StdDevOfNumericAtts",
        "value": "1423.1258869272854"
      },
      {
        "name": "REPTreeDepth1AUC",
        "value": "0.9683092960367538"
      },
      {
        "name": "REPTreeDepth1ErrRate",
        "value": "0.031244290151653573"
      },
      {
        "name": "REPTreeDepth1Kappa",
        "value": "0.8292432028565201"
      },
      {
        "name": "REPTreeDepth2AUC",
        "value": "0.9683092960367538"
      },
      {
        "name": "REPTreeDepth2ErrRate",
        "value": "0.031244290151653573"
      },
      {
        "name": "REPTreeDepth2Kappa",
        "value": "0.8292432028565201"
      },
      {
        "name": "REPTreeDepth3AUC",
        "value": "0.9683092960367538"
      },
      {
        "name": "REPTreeDepth3ErrRate",
        "value": "0.031244290151653573"
      },
      {
        "name": "REPTreeDepth3Kappa",
        "value": "0.8292432028565201"
      },
      {
        "name": "RandomTreeDepth1AUC",
        "value": "0.9174551481492251"
      },
      {
        "name": "RandomTreeDepth1ErrRate",
        "value": "0.030330714416225105"
      },
      {
        "name": "RandomTreeDepth1Kappa",
        "value": "0.834630115762086"
      },
      {
        "name": "RandomTreeDepth2AUC",
        "value": "0.9174551481492251"
      },
      {
        "name": "RandomTreeDepth2ErrRate",
        "value": "0.030330714416225105"
      },
      {
        "name": "RandomTreeDepth2Kappa",
        "value": "0.834630115762086"
      },
      {
        "name": "RandomTreeDepth3AUC",
        "value": "0.9174551481492251"
      },
      {
        "name": "RandomTreeDepth3ErrRate",
        "value": "0.030330714416225105"
      },
      {
        "name": "RandomTreeDepth3Kappa",
        "value": "0.834630115762086"
      },
      {
        "name": "StdvNominalAttDistinctValues",
        "value": "0.0"
      },
      {
        "name": "kNN1NAUC",
        "value": "0.8793112660289029"
      },
      {
        "name": "kNN1NErrRate",
        "value": "0.038735611182167"
      },
      {
        "name": "kNN1NKappa",
        "value": "0.7826036612076944"
      }
    ]
  }
}