{
  "data_set_description": {
    "default_target_attribute": "binaryClass",
    "description": "**Author**:   \n**Source**: Unknown - Date unknown  \n**Please cite**:   \n\nBinarized version of the original data set (see version 1). The multi-class target feature is converted to a two-class nominal target feature by re-labeling the majority class as positive ('P') and all others as negative ('N'). Originally converted by Quan Sun.",
    "description_version": "1",
    "file_id": "53537",
    "format": "ARFF",
    "id": "1003",
    "licence": "Public",
    "md5_checksum": "22e5ca73045502ff417b24e6b4e4bb59",
    "minio_url": "https://data.openml.org/datasets/0000/1003/dataset_1003.pq",
    "name": "primary-tumor",
    "parquet_url": "https://data.openml.org/datasets/0000/1003/dataset_1003.pq",
    "processing_date": "2020-11-20 20:19:29",
    "status": "active",
    "tag": [
      "Health",
      "Medicine",
      "mythbusting_1",
      "study_1",
      "study_144",
      "study_15",
      "study_20",
      "study_41"
    ],
    "upload_date": "2014-10-04T22:44:55",
    "url": "https://api.openml.org/data/v1/download/53537/primary-tumor.arff",
    "version": "2",
    "visibility": "public"
  }
}