{
	"objects": [
		{
			"application": "${CDA_PLUGIN_SOURCE_NAME}|${APPLICATION_NAME}",
			"name": "${APPLICATION_VERSION_NAME}",
			"kind": "ApplicationVersion"
		},
		{
			"environments": [],
			"name": "${CDA_PLUGIN_NAME}-${APPLICATION_NAME}",
			"kind": "Endpoint",
			"plugin": "${CDA_PLUGIN_NAME}/${CDA_PLUGIN_VERSION_NAME}",
			"type": "${CDA_PLUGIN_NAME}",
			"parameters": {
				"URL": "${CDA_URL}",
				"username": "${CDA_USERNAME}",
				"password": "${CDA_PASSWORD}"
			}
		},
		{
			"environments": [],
			"name": "${JIRA_PLUGIN_NAME}-${APPLICATION_NAME}",
			"kind": "Endpoint",
			"plugin": "${JIRA_PLUGIN_NAME}/${JIRA_PLUGIN_VERSION_NAME}",
			"type": "${JIRA_PLUGIN_NAME}",
			"parameters": {
				"useProxy": "false",
				"url": "${JIRA_URL}",
				"username": "${JIRA_USERNAME}",
				"password": "${JIRA_PASSWORD}"
			}
		}
	]
}