<svg width="18" height="18" viewBox="0 0 18 18" fill="none" xmlns="http://www.w3.org/2000/svg">
<path d="M16 0H2C1.46957 0 0.960859 0.210714 0.585786 0.585786C0.210714 0.960859 0 1.46957 0 2V16C0 16.5304 0.210714 17.0391 0.585786 17.4142C0.960859 17.7893 1.46957 18 2 18H16C16.5304 18 17.0391 17.7893 17.4142 17.4142C17.7893 17.0391 18 16.5304 18 16V2C18 1.46957 17.7893 0.960859 17.4142 0.585786C17.0391 0.210714 16.5304 0 16 0ZM16 16H2V2H16V16ZM9 8.25C9.44501 8.25 9.88002 8.11804 10.25 7.87081C10.62 7.62357 10.9084 7.27217 11.0787 6.86104C11.249 6.4499 11.2936 5.9975 11.2068 5.56105C11.12 5.12459 10.9057 4.72368 10.591 4.40901C10.2763 4.09434 9.87541 3.88005 9.43895 3.79323C9.0025 3.70642 8.5501 3.75097 8.13896 3.92127C7.72783 4.09157 7.37643 4.37996 7.12919 4.74997C6.88196 5.11998 6.75 5.55499 6.75 6C6.74868 6.29584 6.80597 6.58902 6.91858 6.8626C7.03118 7.13618 7.19686 7.38475 7.40606 7.59394C7.61525 7.80314 7.86382 7.96882 8.1374 8.08142C8.41098 8.19403 8.70415 8.25132 9 8.25ZM4.75 14H13.25C13.3784 14.0003 13.5047 13.9675 13.6169 13.905C13.729 13.8424 13.8232 13.7521 13.8904 13.6427C13.9577 13.5334 13.9957 13.4085 14.0009 13.2802C14.0061 13.1519 13.9782 13.0245 13.92 12.91L13 11.1C12.8346 10.7717 12.5818 10.4953 12.2696 10.3012C11.9573 10.1072 11.5976 10.003 11.23 10H6.77C6.40237 10.003 6.04266 10.1072 5.73041 10.3012C5.41815 10.4953 5.16543 10.7717 5 11.1L4.1 12.91C4.04251 13.023 4.01457 13.1486 4.01881 13.2753C4.02305 13.402 4.05932 13.5255 4.12423 13.6344C4.18915 13.7432 4.28059 13.8338 4.39002 13.8978C4.49945 13.9617 4.6233 13.9969 4.75 14Z" fill="#768697"/>
</svg>
