<svg width="48" height="48" viewBox="0 0 48 48" fill="none" xmlns="http://www.w3.org/2000/svg">
<path d="M0 24C0 10.7452 10.7452 0 24 0C37.2548 0 48 10.7452 48 24C48 37.2548 37.2548 48 24 48C10.7452 48 0 37.2548 0 24Z" fill="#1C67A2"/>
<path d="M32.8743 30.4429L28.8743 26.4422C28.7447 26.3095 28.6005 26.1921 28.4443 26.0921L27.4443 25.402C28.443 24.1661 28.9915 22.6271 28.9999 21.0381C29.0083 19.449 28.4759 17.9044 27.4903 16.6581C26.5047 15.4117 25.1245 14.5378 23.5765 14.1799C22.0286 13.822 20.4049 14.0014 18.9724 14.6887C17.5399 15.376 16.3838 16.5303 15.694 17.9618C15.0043 19.3933 14.822 21.017 15.177 22.5658C15.5321 24.1147 16.4034 25.4967 17.6478 26.4847C18.8921 27.4727 20.4355 28.008 22.0243 28.0025C23.6123 28.0029 25.1534 27.4633 26.3943 26.4722L27.1443 27.4724C27.2333 27.6012 27.3337 27.7217 27.4443 27.8324L31.4443 31.8331C31.4908 31.88 31.5461 31.9172 31.607 31.9426C31.6679 31.968 31.7333 31.9811 31.7993 31.9811C31.8653 31.9811 31.9307 31.968 31.9916 31.9426C32.0525 31.9172 32.1078 31.88 32.1543 31.8331L32.8543 31.133C32.9457 31.0426 32.9988 30.9205 33.0025 30.792C33.0062 30.6635 32.9603 30.5384 32.8743 30.4429ZM22.0243 26.0021C21.0354 26.0021 20.0687 25.7088 19.2465 25.1593C18.4242 24.6098 17.7833 23.8288 17.4049 22.915C17.0265 22.0012 16.9275 20.9957 17.1204 20.0256C17.3133 19.0555 17.7895 18.1644 18.4888 17.465C19.188 16.7657 20.0789 16.2894 21.0489 16.0964C22.0188 15.9035 23.0241 16.0025 23.9377 16.381C24.8513 16.7595 25.6322 17.4005 26.1816 18.2229C26.7311 19.0453 27.0243 20.0121 27.0243 21.0012C27.0243 22.3275 26.4975 23.5995 25.5598 24.5374C24.6222 25.4752 23.3504 26.0021 22.0243 26.0021Z" fill="white"/>
</svg>
