<svg width="30" height="28" viewBox="0 0 30 28" fill="none" xmlns="http://www.w3.org/2000/svg">
<path fill-rule="evenodd" clip-rule="evenodd" d="M28.9963 10.2937C28.9942 10.2352 28.9853 10.1772 28.9618 10.1207C28.9618 10.1202 28.9613 10.1197 28.9608 10.1192C28.9593 10.1152 28.9553 10.1117 28.9533 10.1072C28.9308 10.0572 28.9002 10.0132 28.8643 9.97425C28.8523 9.96175 28.8393 9.95175 28.8263 9.94025C28.7943 9.91225 28.7598 9.88875 28.7218 9.86975C28.7057 9.86225 28.6913 9.85375 28.6743 9.84725C28.6193 9.82675 28.5613 9.81225 28.4998 9.81225H24.0068C23.7308 9.81225 23.5068 10.0357 23.5068 10.3122C23.5068 10.5887 23.7308 10.8122 24.0068 10.8122H27.2928L18.0773 20.0282C17.9808 20.1243 17.8542 20.1688 17.7153 20.1742C17.5788 20.1723 17.4523 20.1162 17.3588 20.0157L13.5498 15.9467C13.2698 15.6472 12.8897 15.4787 12.4802 15.4717C12.0747 15.4727 11.6847 15.6212 11.3942 15.9107L1.14625 26.1588C0.95125 26.3542 0.95125 26.6707 1.14625 26.8663C1.24425 26.9638 1.37175 27.0128 1.49975 27.0128C1.62775 27.0128 1.75575 26.9638 1.85325 26.8663L12.1007 16.6182C12.1978 16.5217 12.3273 16.4837 12.4633 16.4717C12.6003 16.4737 12.7262 16.5307 12.8197 16.6302L16.6288 20.6997C16.9088 20.9987 17.2888 21.1672 17.6988 21.1742C18.1108 21.1742 18.4942 21.0252 18.7843 20.7352L27.9998 11.5192V14.9082C27.9998 15.1847 28.2238 15.4082 28.4998 15.4082C28.7763 15.4082 28.9998 15.1847 28.9998 14.9082V10.3122C28.9998 10.3052 28.9963 10.3007 28.9963 10.2937ZM4.8739 3.23905L5.1359 2.92005C6.4284 1.72455 8.5109 1.73055 9.7934 2.94105C9.9829 3.11955 10.2784 3.12305 10.4719 2.94855L10.5529 2.87505C11.8489 1.70455 13.9294 1.72905 15.1914 2.93005L15.2294 2.96605C15.9064 3.62005 16.2844 4.48955 16.2944 5.41455C16.3039 6.33755 15.9469 7.22105 15.2889 7.90105C13.7419 9.50205 12.0204 10.9615 10.1679 12.2435L10.1634 12.2395C8.3364 10.9785 6.6334 9.54105 5.1004 7.96755C3.8079 6.64055 3.7124 4.65155 4.8739 3.23905ZM9.5949 13.0625L9.8834 13.2615C9.9684 13.3205 10.0679 13.35 10.1669 13.35C10.2649 13.35 10.3629 13.321 10.4474 13.264C12.4639 11.8975 14.3349 10.3275 16.0079 8.59655C16.8499 7.72605 17.3069 6.59155 17.2944 5.40355C17.2814 4.20905 16.7949 3.08805 15.9244 2.24755C15.9234 2.24655 15.8819 2.20655 15.8809 2.20555C14.3009 0.702547 11.8374 0.601547 10.1349 1.92155C8.4564 0.645547 5.9859 0.743047 4.4274 2.21355C4.4124 2.22855 4.3979 2.24355 4.3844 2.26005L4.1014 2.60405C2.6104 4.41705 2.7294 6.96655 4.3839 8.66505C5.9619 10.285 7.7149 11.7645 9.5949 13.0625Z" fill="#1C67A2" stroke="#1C67A2" stroke-width="0.8"/>
</svg>
