<svg width="48" height="48" viewBox="0 0 48 48" fill="none" xmlns="http://www.w3.org/2000/svg">
<path d="M41 14H7C6.20435 14 5.44129 14.3161 4.87868 14.8787C4.31607 15.4413 4 16.2044 4 17V41C4 41.7957 4.31607 42.5587 4.87868 43.1213C5.44129 43.6839 6.20435 44 7 44H41C41.7957 44 42.5587 43.6839 43.1213 43.1213C43.6839 42.5587 44 41.7957 44 41V17C44 16.2044 43.6839 15.4413 43.1213 14.8787C42.5587 14.3161 41.7957 14 41 14ZM42 41C42 41.2652 41.8946 41.5196 41.7071 41.7071C41.5196 41.8946 41.2652 42 41 42H7C6.73478 42 6.48043 41.8946 6.29289 41.7071C6.10536 41.5196 6 41.2652 6 41V17C6 16.7348 6.10536 16.4804 6.29289 16.2929C6.48043 16.1054 6.73478 16 7 16H41C41.2652 16 41.5196 16.1054 41.7071 16.2929C41.8946 16.4804 42 16.7348 42 17V41ZM16 10H32V13H34V6C34 5.46957 33.7893 4.96086 33.4142 4.58579C33.0391 4.21071 32.5304 4 32 4H16C15.4696 4 14.9609 4.21071 14.5858 4.58579C14.2107 4.96086 14 5.46957 14 6V13H16V10ZM32 6V8H16V6H32ZM27 21H21V26H16V32H21V37H27V32H32V26H27V21ZM30 28V30H25V35H23V30H18V28H23V23H25V28H30Z" fill="#1C67A2"/>
</svg>
