<svg width="73" height="73" viewBox="0 0 73 73" fill="none" xmlns="http://www.w3.org/2000/svg">
<path d="M49.64 49.4453H49.4453V73H31.1467C26.864 73 23.36 69.496 23.36 65.2133V49.4453H0C0 48.2773 0 46.136 0 43.6053V31.1467C0 27.2533 2.92 24.1387 6.81333 23.5547C5.45067 23.7493 4.28267 23.944 2.92 24.1387C4.86667 23.7493 7.008 23.36 9.344 23.36C14.016 23.36 18.688 23.36 23.36 23.36H23.5547V0H41.6587C45.9413 0 49.4453 3.504 49.4453 7.78667V23.5547H73C73 24.7227 73 26.864 73 29.3947V41.8533C73 45.7467 70.08 48.8613 66.1867 49.4453C66.9653 49.4453 67.5493 49.2507 68.328 49.2507C66.7707 49.4453 65.408 49.64 63.8507 49.64C58.984 49.4453 54.312 49.4453 49.64 49.4453ZM0.778667 24.7227C1.168 24.528 1.752 24.528 2.14133 24.3333C1.752 24.528 1.36267 24.528 0.778667 24.7227ZM72.0267 48.2773C71.6373 48.472 71.248 48.472 70.664 48.6667C71.248 48.472 71.6373 48.2773 72.0267 48.2773ZM69.8853 48.6667C69.3013 48.8613 68.7173 48.8613 68.1333 49.056C68.7173 49.056 69.3013 48.8613 69.8853 48.6667Z" fill="url(#paint0_linear)"/>
<defs>
<linearGradient id="paint0_linear" x1="36.5" y1="0" x2="36.5" y2="73" gradientUnits="userSpaceOnUse">
<stop stop-color="#E5F3FC"/>
<stop offset="1" stop-color="#BED9EE"/>
</linearGradient>
</defs>
</svg>
