<svg width="24" height="34" viewBox="0 0 24 34" fill="none" xmlns="http://www.w3.org/2000/svg">
<path d="M16.5118 0.333252H2.00016C1.55814 0.333252 1.13421 0.508847 0.821652 0.821407C0.509091 1.13397 0.333496 1.55789 0.333496 1.99992V31.9999C0.333496 32.4419 0.509091 32.8659 0.821652 33.1784C1.13421 33.491 1.55814 33.6666 2.00016 33.6666H22.0002C22.4422 33.6666 22.8661 33.491 23.1787 33.1784C23.4912 32.8659 23.6668 32.4419 23.6668 31.9999V7.48825L16.5118 0.333252ZM17.0002 3.17825L20.8218 6.99992H17.0002V3.17825ZM2.00016 31.9999V1.99992H15.3335V6.99992C15.3335 7.44195 15.5091 7.86587 15.8217 8.17843C16.1342 8.49099 16.5581 8.66659 17.0002 8.66659H22.0002V31.9999H2.00016ZM3.66683 23.6666H17.0002V25.3333H3.66683V23.6666ZM3.66683 20.3333H20.3335V21.9999H3.66683V20.3333ZM6.16683 14.4999H3.66683V12.8333H6.16683V10.3333H7.8335V12.8333H10.3335V14.4999H7.8335V16.9999H6.16683V14.4999Z" fill="#1C67A2"/>
</svg>
