<svg width="48" height="48" viewBox="0 0 48 48" fill="none" xmlns="http://www.w3.org/2000/svg">
<path d="M25.819 26H30V28H24.181L23.5 24.6L21.819 33H19.142L17.386 21.582L15.781 28H10V26H14.219L16.219 18H18.858L20.558 29.084L22.181 21H24.819L25.819 26ZM42 8L41.98 38.2L40.819 44H37.181L36 38V8C36 7.46957 36.2107 6.96086 36.5858 6.58579C36.9609 6.21071 37.4696 6 38 6H40C40.5304 6 41.0391 6.21071 41.4142 6.58579C41.7893 6.96086 42 7.46957 42 8ZM38 8V14H40V8H38ZM40 37.9V16H38V37.9L38.819 42H39.181L40 37.9ZM28 8H34V41C34 41.7957 33.6839 42.5587 33.1213 43.1213C32.5587 43.6839 31.7956 44 31 44H9C8.20435 44 7.44129 43.6839 6.87868 43.1213C6.31607 42.5587 6 41.7957 6 41V8H12V6H16V4H24V6H28V8ZM14 10H26V8H22V6H18V8H14V10ZM28 10V12H12V10H8V41C8 41.2652 8.10536 41.5196 8.29289 41.7071C8.48043 41.8946 8.73478 42 9 42H31C31.2652 42 31.5196 41.8946 31.7071 41.7071C31.8946 41.5196 32 41.2652 32 41V10H28Z" fill="#1C67A2"/>
</svg>
