<svg width="40" height="40" viewBox="0 0 40 40" fill="none" xmlns="http://www.w3.org/2000/svg">
<path d="M33.3336 14.0334C31.052 8.94296 25.9406 5.39697 20.001 5.39697C12.2023 5.39697 5.85013 11.515 5.43762 19.2109" stroke="#1C67A2" stroke-width="2" stroke-miterlimit="10" stroke-linecap="round"/>
<path d="M10.3005 15.9839L5.83329 20.0003L1.66663 15.9839" stroke="#1C67A2" stroke-width="2" stroke-miterlimit="10" stroke-linecap="round"/>
<path d="M6.66663 26.3639C8.94827 31.4544 14.0596 35.0004 19.9992 35.0004C27.7979 35.0004 34.1501 28.8824 34.5626 21.1865" stroke="#1C67A2" stroke-width="2" stroke-miterlimit="10" stroke-linecap="round"/>
<path d="M29.6998 24.4134L34.167 20.397L38.3337 24.4134" stroke="#1C67A2" stroke-width="2" stroke-miterlimit="10" stroke-linecap="round"/>
<path d="M22.1872 16.7435C22.1872 16.7435 21.4516 15.2165 19.6079 15.196C16.7062 15.1637 15.4612 19.2697 18.8793 20.4447C24.1752 22.2652 22.2602 26.5208 19.6595 26.5445C17.4844 26.5643 16.6032 25.0638 16.5081 24.8496" stroke="#1C67A2" stroke-width="2" stroke-miterlimit="10" stroke-linecap="round"/>
<path d="M19.5087 13.3462L19.5758 28.4505" stroke="#1C67A2" stroke-width="2" stroke-miterlimit="10" stroke-linecap="round"/>
</svg>
