<svg width="27" height="28" viewBox="0 0 27 28" fill="none" xmlns="http://www.w3.org/2000/svg">
<path fill-rule="evenodd" clip-rule="evenodd" d="M22.5543 26.0216H25.3587C25.6162 26.0216 25.826 25.8122 25.826 25.5542V22.5578H22.5543V26.0216ZM10.0544 18.7051V26.0216H17.5654V18.7051C17.5654 18.1895 17.1461 17.7703 16.6306 17.7703H10.9892C10.4736 17.7703 10.0544 18.1895 10.0544 18.7051ZM5.72822 4.05421V13.7918V26.0216H9.11961V18.7051C9.11961 17.674 9.95811 16.8355 10.9892 16.8355H16.6306C17.6612 16.8355 18.5002 17.674 18.5002 18.7051V26.0216H21.6195V13.7918V4.05421C21.6195 2.76561 20.5712 1.71725 19.2826 1.71725H8.06518C6.77658 1.71725 5.72822 2.76561 5.72822 4.05421ZM1.5217 22.5578V25.5542C1.5217 25.8122 1.73156 26.0216 1.98909 26.0216H4.79344V22.5578H1.5217ZM4.79344 14.2592H2.45648C1.94095 14.2592 1.5217 14.6785 1.5217 15.194V17.3908H4.79344V14.2592ZM4.79344 21.623H1.5217V18.3255H4.79344V21.623ZM25.826 21.623H22.5543V18.3255H25.826V21.623ZM25.826 15.194C25.826 14.6785 25.4068 14.2592 24.8913 14.2592H22.5543V17.3908H25.826V15.194ZM22.5543 13.3244H24.8913C25.9223 13.3244 26.7608 14.1629 26.7608 15.194V25.5542C26.7608 26.3273 26.1317 26.9564 25.3587 26.9564H22.0869H18.0328H9.587H5.26083H1.98909C1.21602 26.9564 0.586914 26.3273 0.586914 25.5542V15.194C0.586914 14.1629 1.42541 13.3244 2.45648 13.3244H4.79344V4.05421C4.79344 2.25055 6.26105 0.782471 8.06518 0.782471H19.2826C21.0867 0.782471 22.5543 2.25055 22.5543 4.05421V13.3244ZM13.6739 4.28779C15.9931 4.28779 17.8804 6.17465 17.8804 8.49431C17.8804 10.814 15.9931 12.7008 13.6739 12.7008C11.3547 12.7008 9.46733 10.814 9.46733 8.49431C9.46733 6.17465 11.3547 4.28779 13.6739 4.28779ZM13.6739 13.6356C16.5086 13.6356 18.8152 11.329 18.8152 8.49431C18.8152 5.65958 16.5086 3.35301 13.6739 3.35301C10.8391 3.35301 8.53255 5.65958 8.53255 8.49431C8.53255 11.329 10.8391 13.6356 13.6739 13.6356ZM12.2717 10.3639C12.5297 10.3639 12.739 10.1549 12.739 9.89646V8.96168H14.6086V9.89646C14.6086 10.1549 14.818 10.3639 15.076 10.3639C15.334 10.3639 15.5434 10.1549 15.5434 9.89646V7.09211C15.5434 6.83365 15.334 6.62472 15.076 6.62472C14.818 6.62472 14.6086 6.83365 14.6086 7.09211V8.0269H12.739V7.09211C12.739 6.83365 12.5297 6.62472 12.2717 6.62472C12.0137 6.62472 11.8043 6.83365 11.8043 7.09211V9.89646C11.8043 10.1549 12.0137 10.3639 12.2717 10.3639Z" fill="#1C67A2"/>
<path d="M22.5543 26.0216H22.3543V26.2216H22.5543V26.0216ZM25.826 22.5578H26.026V22.3578H25.826V22.5578ZM22.5543 22.5578V22.3578H22.3543V22.5578H22.5543ZM10.0544 26.0216H9.85439V26.2216H10.0544V26.0216ZM17.5654 26.0216V26.2216H17.7654V26.0216H17.5654ZM5.72822 26.0216H5.52822V26.2216H5.72822V26.0216ZM9.11961 26.0216V26.2216H9.31961V26.0216H9.11961ZM18.5002 26.0216H18.3002V26.2216H18.5002V26.0216ZM21.6195 26.0216V26.2216H21.8195V26.0216H21.6195ZM1.5217 22.5578V22.3578H1.3217V22.5578H1.5217ZM4.79344 26.0216V26.2216H4.99344V26.0216H4.79344ZM4.79344 22.5578H4.99344V22.3578H4.79344V22.5578ZM4.79344 14.2592H4.99344V14.0592H4.79344V14.2592ZM1.5217 17.3908H1.3217V17.5908H1.5217V17.3908ZM4.79344 17.3908V17.5908H4.99344V17.3908H4.79344ZM1.5217 21.623H1.3217V21.823H1.5217V21.623ZM4.79344 21.623V21.823H4.99344V21.623H4.79344ZM1.5217 18.3255V18.1255H1.3217V18.3255H1.5217ZM4.79344 18.3255H4.99344V18.1255H4.79344V18.3255ZM22.5543 21.623H22.3543V21.823H22.5543V21.623ZM25.826 21.623V21.823H26.026V21.623H25.826ZM22.5543 18.3255V18.1255H22.3543V18.3255H22.5543ZM25.826 18.3255H26.026V18.1255H25.826V18.3255ZM22.5543 14.2592V14.0592H22.3543V14.2592H22.5543ZM22.5543 17.3908H22.3543V17.5908H22.5543V17.3908ZM25.826 17.3908V17.5908H26.026V17.3908H25.826ZM22.5543 13.3244H22.3543V13.5244H22.5543V13.3244ZM4.79344 13.3244V13.5244H4.99344V13.3244H4.79344ZM12.739 8.96168V8.76168H12.539V8.96168H12.739ZM14.6086 8.96168H14.8086V8.76168H14.6086V8.96168ZM14.6086 8.0269V8.2269H14.8086V8.0269H14.6086ZM12.739 8.0269H12.539V8.2269H12.739V8.0269ZM25.3587 25.8216H22.5543V26.2216H25.3587V25.8216ZM25.626 25.5542C25.626 25.7016 25.5059 25.8216 25.3587 25.8216V26.2216C25.7265 26.2216 26.026 25.9228 26.026 25.5542H25.626ZM25.626 22.5578V25.5542H26.026V22.5578H25.626ZM22.5543 22.7578H25.826V22.3578H22.5543V22.7578ZM22.7543 26.0216V22.5578H22.3543V26.0216H22.7543ZM10.2544 26.0216V18.7051H9.85439V26.0216H10.2544ZM17.5654 25.8216H10.0544V26.2216H17.5654V25.8216ZM17.3654 18.7051V26.0216H17.7654V18.7051H17.3654ZM16.6306 17.9703C17.0357 17.9703 17.3654 18.3 17.3654 18.7051H17.7654C17.7654 18.0791 17.2566 17.5703 16.6306 17.5703V17.9703ZM10.9892 17.9703H16.6306V17.5703H10.9892V17.9703ZM10.2544 18.7051C10.2544 18.3 10.5841 17.9703 10.9892 17.9703V17.5703C10.3632 17.5703 9.85439 18.0791 9.85439 18.7051H10.2544ZM5.92822 13.7918V4.05421H5.52822V13.7918H5.92822ZM5.92822 26.0216V13.7918H5.52822V26.0216H5.92822ZM9.11961 25.8216H5.72822V26.2216H9.11961V25.8216ZM8.91961 18.7051V26.0216H9.31961V18.7051H8.91961ZM10.9892 16.6355C9.84765 16.6355 8.91961 17.5635 8.91961 18.7051H9.31961C9.31961 17.7845 10.0686 17.0355 10.9892 17.0355V16.6355ZM16.6306 16.6355H10.9892V17.0355H16.6306V16.6355ZM18.7002 18.7051C18.7002 17.5635 17.7716 16.6355 16.6306 16.6355V17.0355C17.5508 17.0355 18.3002 17.7845 18.3002 18.7051H18.7002ZM18.7002 26.0216V18.7051H18.3002V26.0216H18.7002ZM21.6195 25.8216H18.5002V26.2216H21.6195V25.8216ZM21.4195 13.7918V26.0216H21.8195V13.7918H21.4195ZM21.4195 4.05421V13.7918H21.8195V4.05421H21.4195ZM19.2826 1.91725C20.4607 1.91725 21.4195 2.87607 21.4195 4.05421H21.8195C21.8195 2.65516 20.6816 1.51725 19.2826 1.51725V1.91725ZM8.06518 1.91725H19.2826V1.51725H8.06518V1.91725ZM5.92822 4.05421C5.92822 2.87607 6.88703 1.91725 8.06518 1.91725V1.51725C6.66612 1.51725 5.52822 2.65516 5.52822 4.05421H5.92822ZM1.7217 25.5542V22.5578H1.3217V25.5542H1.7217ZM1.98909 25.8216C1.84188 25.8216 1.7217 25.7016 1.7217 25.5542H1.3217C1.3217 25.9228 1.62123 26.2216 1.98909 26.2216V25.8216ZM4.79344 25.8216H1.98909V26.2216H4.79344V25.8216ZM4.59344 22.5578V26.0216H4.99344V22.5578H4.59344ZM1.5217 22.7578H4.79344V22.3578H1.5217V22.7578ZM2.45648 14.4592H4.79344V14.0592H2.45648V14.4592ZM1.7217 15.194C1.7217 14.7889 2.0514 14.4592 2.45648 14.4592V14.0592C1.83049 14.0592 1.3217 14.568 1.3217 15.194H1.7217ZM1.7217 17.3908V15.194H1.3217V17.3908H1.7217ZM4.79344 17.1908H1.5217V17.5908H4.79344V17.1908ZM4.59344 14.2592V17.3908H4.99344V14.2592H4.59344ZM1.5217 21.823H4.79344V21.423H1.5217V21.823ZM1.3217 18.3255V21.623H1.7217V18.3255H1.3217ZM4.79344 18.1255H1.5217V18.5255H4.79344V18.1255ZM4.99344 21.623V18.3255H4.59344V21.623H4.99344ZM22.5543 21.823H25.826V21.423H22.5543V21.823ZM22.3543 18.3255V21.623H22.7543V18.3255H22.3543ZM25.826 18.1255H22.5543V18.5255H25.826V18.1255ZM26.026 21.623V18.3255H25.626V21.623H26.026ZM24.8913 14.4592C25.2963 14.4592 25.626 14.7889 25.626 15.194H26.026C26.026 14.568 25.5173 14.0592 24.8913 14.0592V14.4592ZM22.5543 14.4592H24.8913V14.0592H22.5543V14.4592ZM22.7543 17.3908V14.2592H22.3543V17.3908H22.7543ZM25.826 17.1908H22.5543V17.5908H25.826V17.1908ZM25.626 15.194V17.3908H26.026V15.194H25.626ZM24.8913 13.1244H22.5543V13.5244H24.8913V13.1244ZM26.9608 15.194C26.9608 14.0525 26.0328 13.1244 24.8913 13.1244V13.5244C25.8119 13.5244 26.5608 14.2734 26.5608 15.194H26.9608ZM26.9608 25.5542V15.194H26.5608V25.5542H26.9608ZM25.3587 27.1564C26.2422 27.1564 26.9608 26.4377 26.9608 25.5542H26.5608C26.5608 26.2168 26.0213 26.7564 25.3587 26.7564V27.1564ZM22.0869 27.1564H25.3587V26.7564H22.0869V27.1564ZM18.0328 27.1564H22.0869V26.7564H18.0328V27.1564ZM9.587 27.1564H18.0328V26.7564H9.587V27.1564ZM5.26083 27.1564H9.587V26.7564H5.26083V27.1564ZM1.98909 27.1564H5.26083V26.7564H1.98909V27.1564ZM0.386914 25.5542C0.386914 26.4377 1.10557 27.1564 1.98909 27.1564V26.7564C1.32648 26.7564 0.786914 26.2168 0.786914 25.5542H0.386914ZM0.386914 15.194V25.5542H0.786914V15.194H0.386914ZM2.45648 13.1244C1.31496 13.1244 0.386914 14.0525 0.386914 15.194H0.786914C0.786914 14.2734 1.53587 13.5244 2.45648 13.5244V13.1244ZM4.79344 13.1244H2.45648V13.5244H4.79344V13.1244ZM4.59344 4.05421V13.3244H4.99344V4.05421H4.59344ZM8.06518 0.582471C6.15057 0.582471 4.59344 2.14011 4.59344 4.05421H4.99344C4.99344 2.36099 6.37152 0.982471 8.06518 0.982471V0.582471ZM19.2826 0.582471H8.06518V0.982471H19.2826V0.582471ZM22.7543 4.05421C22.7543 2.14011 21.1972 0.582471 19.2826 0.582471V0.982471C20.9762 0.982471 22.3543 2.36099 22.3543 4.05421H22.7543ZM22.7543 13.3244V4.05421H22.3543V13.3244H22.7543ZM18.0804 8.49431C18.0804 6.06418 16.1035 4.08779 13.6739 4.08779V4.48779C15.8826 4.48779 17.6804 6.28512 17.6804 8.49431H18.0804ZM13.6739 12.9008C16.1035 12.9008 18.0804 10.9244 18.0804 8.49431H17.6804C17.6804 10.7035 15.8826 12.5008 13.6739 12.5008V12.9008ZM9.26733 8.49431C9.26733 10.9244 11.2442 12.9008 13.6739 12.9008V12.5008C11.4651 12.5008 9.66733 10.7035 9.66733 8.49431H9.26733ZM13.6739 4.08779C11.2442 4.08779 9.26733 6.06418 9.26733 8.49431H9.66733C9.66733 6.28512 11.4651 4.48779 13.6739 4.48779V4.08779ZM18.6152 8.49431C18.6152 11.2186 16.3981 13.4356 13.6739 13.4356V13.8356C16.619 13.8356 19.0152 11.4395 19.0152 8.49431H18.6152ZM13.6739 3.55301C16.3981 3.55301 18.6152 5.77004 18.6152 8.49431H19.0152C19.0152 5.54912 16.619 3.15301 13.6739 3.15301V3.55301ZM8.73255 8.49431C8.73255 5.77004 10.9496 3.55301 13.6739 3.55301V3.15301C10.7287 3.15301 8.33255 5.54912 8.33255 8.49431H8.73255ZM13.6739 13.4356C10.9496 13.4356 8.73255 11.2186 8.73255 8.49431H8.33255C8.33255 11.4395 10.7287 13.8356 13.6739 13.8356V13.4356ZM12.539 9.89646C12.539 10.0443 12.4193 10.1639 12.2717 10.1639V10.5639C12.64 10.5639 12.939 10.2655 12.939 9.89646H12.539ZM12.539 8.96168V9.89646H12.939V8.96168H12.539ZM14.6086 8.76168H12.739V9.16168H14.6086V8.76168ZM14.8086 9.89646V8.96168H14.4086V9.89646H14.8086ZM15.076 10.1639C14.9283 10.1639 14.8086 10.0443 14.8086 9.89646H14.4086C14.4086 10.2655 14.7077 10.5639 15.076 10.5639V10.1639ZM15.3434 9.89646C15.3434 10.0443 15.2237 10.1639 15.076 10.1639V10.5639C15.4443 10.5639 15.7434 10.2655 15.7434 9.89646H15.3434ZM15.3434 7.09211V9.89646H15.7434V7.09211H15.3434ZM15.076 6.82472C15.2237 6.82472 15.3434 6.94423 15.3434 7.09211H15.7434C15.7434 6.72306 15.4443 6.42472 15.076 6.42472V6.82472ZM14.8086 7.09211C14.8086 6.94423 14.9283 6.82472 15.076 6.82472V6.42472C14.7077 6.42472 14.4086 6.72306 14.4086 7.09211H14.8086ZM14.8086 8.0269V7.09211H14.4086V8.0269H14.8086ZM12.739 8.2269H14.6086V7.8269H12.739V8.2269ZM12.539 7.09211V8.0269H12.939V7.09211H12.539ZM12.2717 6.82472C12.4193 6.82472 12.539 6.94423 12.539 7.09211H12.939C12.939 6.72306 12.64 6.42472 12.2717 6.42472V6.82472ZM12.0043 7.09211C12.0043 6.94423 12.124 6.82472 12.2717 6.82472V6.42472C11.9033 6.42472 11.6043 6.72306 11.6043 7.09211H12.0043ZM12.0043 9.89646V7.09211H11.6043V9.89646H12.0043ZM12.2717 10.1639C12.124 10.1639 12.0043 10.0443 12.0043 9.89646H11.6043C11.6043 10.2655 11.9033 10.5639 12.2717 10.5639V10.1639Z" fill="#1C67A2"/>
</svg>
