<svg width="34" height="40" viewBox="0 0 34 40" fill="none" xmlns="http://www.w3.org/2000/svg">
<path d="M32.4866 19.9999C32.4866 19.4443 32.2782 18.8888 31.931 18.4721C34.0838 14.7221 34.3616 11.2499 32.7643 8.88878C31.2366 6.66656 28.1116 5.76378 24.0838 6.31934C22.2782 2.77767 19.7782 0.694336 16.931 0.694336C14.7088 0.694336 12.556 2.08322 10.8199 4.65267C10.5421 4.58322 10.2643 4.51378 9.98656 4.51378C8.87545 4.51378 7.97267 5.20822 7.6949 6.24989C4.70878 6.24989 2.41712 7.15267 1.16712 8.95823C-0.430105 11.2499 -0.152327 14.5138 1.79212 18.1943C2.13934 18.8193 2.48656 19.4443 2.90323 19.9999C2.48656 20.6249 2.13934 21.2499 1.79212 21.8054C-0.221772 25.486 -0.430105 28.7499 1.16712 31.0416C2.41712 32.8471 4.63934 33.7499 7.62545 33.7499C7.6949 33.7499 7.6949 33.7499 7.76434 33.7499C8.11156 34.5832 9.01434 35.2082 9.98656 35.2082C10.2643 35.2082 10.4727 35.1388 10.681 35.0693C12.4171 37.7082 14.6393 39.236 16.931 39.236C19.7782 39.236 22.2782 37.0832 24.0838 33.611C24.8477 33.6804 25.6116 33.7499 26.306 33.7499C29.2921 33.7499 31.5143 32.7777 32.7643 31.0416C34.3616 28.7499 34.0838 25.2777 31.931 21.4582C32.2782 21.111 32.4866 20.5554 32.4866 19.9999ZM23.2505 32.0832C21.7227 31.8054 20.1949 31.3193 18.5977 30.6943C19.9866 29.9999 21.3755 29.1666 22.6949 28.1943C23.4588 27.6388 24.2227 27.0832 24.9866 26.4582C24.5699 28.5416 24.0143 30.486 23.2505 32.0832ZM12.2088 31.736C11.7921 30.9721 11.0282 30.4166 10.056 30.4166C9.63934 29.1666 9.29212 27.8471 9.01434 26.4582C9.77823 27.0832 10.4727 27.6388 11.306 28.1943C12.6255 29.1666 14.0143 29.9304 15.4032 30.6943C14.2921 31.111 13.2505 31.4582 12.2088 31.736ZM10.1255 9.37489C10.9588 9.37489 11.7227 8.88878 12.1393 8.26378C13.181 8.54156 14.2921 8.88878 15.4032 9.37489C14.0143 10.0693 12.6255 10.9027 11.306 11.8749C10.5421 12.4304 9.77823 12.986 9.01434 13.611C9.29212 12.0832 9.63934 10.6943 10.1255 9.37489ZM7.13934 22.8471C6.23656 21.9443 5.40323 20.9721 4.70878 19.9999C5.40323 19.0277 6.23656 18.0554 7.13934 17.1527C7.0699 18.1249 7.00045 19.0277 7.00045 19.9999C7.00045 20.9721 7.0699 21.9443 7.13934 22.8471ZM12.0699 27.0832C10.8199 26.2499 9.70878 25.3471 8.66712 24.3749C8.52823 22.986 8.38934 21.5277 8.38934 20.0693C8.38934 18.611 8.45878 17.1527 8.66712 15.7638C9.70878 14.7916 10.8893 13.8888 12.0699 13.0554C13.6671 11.9443 15.3338 10.9721 17.0005 10.1388C18.6671 10.9027 20.3338 11.8749 21.931 13.0554C23.1116 13.8888 24.2921 14.7916 25.3338 15.7638C25.5421 17.1527 25.6116 18.611 25.6116 20.1388C25.6116 21.5971 25.5421 23.0554 25.3338 24.5138C24.2921 25.486 23.1116 26.3888 21.931 27.2221C20.3338 28.3332 18.6671 29.3054 17.0005 30.1388C15.3338 29.1666 13.6671 28.1943 12.0699 27.0832ZM24.9866 13.5416C24.2227 12.9166 23.5282 12.361 22.6949 11.8054C21.3755 10.9027 19.9866 10.0693 18.5977 9.30545C20.1949 8.68045 21.7227 8.19434 23.2505 7.91656C24.0143 9.51378 24.5699 11.4582 24.9866 13.5416ZM26.8616 17.1527C27.2782 17.6388 27.7643 18.0554 28.1116 18.5416C27.7643 18.9582 27.6255 19.4443 27.6255 19.9999C27.6255 20.5554 27.8338 21.0416 28.1116 21.4582C27.6949 21.9443 27.2782 22.361 26.8616 22.8471C26.931 21.9443 27.0005 20.9721 27.0005 19.9999C27.0005 19.0277 26.931 18.0554 26.8616 17.1527ZM29.0143 19.9999C29.0143 19.4443 29.5005 18.9582 30.056 18.9582C30.6116 18.9582 31.0977 19.4443 31.0977 19.9999C31.0977 20.5554 30.6116 21.0416 30.056 21.0416C29.5005 21.0416 29.0143 20.5554 29.0143 19.9999ZM31.6532 9.72211C32.9727 11.5277 32.6255 14.4443 30.8199 17.7082C30.6116 17.6388 30.3338 17.5693 30.056 17.5693C29.7782 17.5693 29.5005 17.6388 29.2921 17.7082C28.5282 16.8054 27.6255 15.8332 26.6532 14.9999C26.306 12.2916 25.6116 9.79156 24.7088 7.70822C28.0421 7.361 30.4727 8.05545 31.6532 9.72211ZM17.0005 2.08322C19.1532 2.08322 21.0977 3.81934 22.6255 6.59711C20.8199 7.01378 18.8755 7.63878 17.0005 8.47211C15.4727 7.77767 13.9449 7.22211 12.4866 6.80545C12.4866 6.31934 12.2782 5.83322 12.0005 5.41656C13.4588 3.33322 15.2643 2.08322 17.0005 2.08322ZM10.056 5.90267C10.6116 5.90267 11.0977 6.38878 11.0977 6.94434C11.0977 7.49989 10.6116 7.986 10.056 7.986C9.50045 7.986 9.01434 7.49989 9.01434 6.94434C9.01434 6.38878 9.50045 5.90267 10.056 5.90267ZM3.04212 17.4999C1.30601 14.3054 1.02823 11.5277 2.27823 9.72211C3.52823 7.986 5.75045 7.56934 7.6949 7.56934C7.83378 8.12489 8.25045 8.68045 8.73656 8.95823C8.11156 10.7638 7.62545 12.7777 7.27823 14.9304C5.95878 16.1804 4.77823 17.4304 3.73656 18.7499C3.52823 18.4027 3.3199 17.9166 3.04212 17.4999ZM2.34767 30.2777C1.09767 28.4721 1.37545 25.6943 3.11156 22.4999C3.3199 22.0832 3.59767 21.6666 3.87545 21.1804C4.84767 22.4999 6.02823 23.7499 7.41712 24.9999C7.6949 27.0832 8.18101 29.0277 8.80601 30.8332C8.25045 31.1804 7.90323 31.736 7.76434 32.4304C5.8199 32.4304 3.52823 32.0138 2.34767 30.2777ZM9.01434 32.8471C9.01434 32.361 9.36156 31.9443 9.77823 31.8749C9.84767 31.8749 9.91712 31.8749 9.98656 31.8749C10.5421 31.8749 11.0282 32.361 11.0282 32.9166C11.0282 33.4721 10.6116 33.8888 10.056 33.8888C9.50045 33.8888 9.01434 33.4027 9.01434 32.8471ZM17.0005 37.9166C15.1949 37.9166 13.3893 36.6666 11.931 34.3749C12.2088 34.0277 12.4171 33.611 12.4866 33.1249C14.0143 32.7082 15.5421 32.1527 17.0699 31.4582C19.0143 32.361 20.8893 32.986 22.6949 33.3332C21.0977 36.1804 19.1532 37.9166 17.0005 37.9166ZM31.6532 30.2777C30.4727 31.9443 28.0421 32.7082 24.7088 32.2916C25.6116 30.2082 26.2366 27.7082 26.6532 24.9999C27.6255 24.0971 28.4588 23.1943 29.2921 22.2916C29.5699 22.361 29.7782 22.4304 30.056 22.4304C30.3338 22.4304 30.5421 22.361 30.8199 22.2916C32.6255 25.5554 32.9727 28.4027 31.6532 30.2777Z" fill="#1C67A2" stroke="#1C67A2" stroke-width="0.2"/>
</svg>
