<svg width="20" height="20" viewBox="0 0 20 20" fill="none" xmlns="http://www.w3.org/2000/svg">
<path d="M10 1.01105C8.21997 1.01105 6.47991 1.53898 4.99987 2.52809C3.51983 3.5172 2.36628 4.92306 1.68509 6.56788C1.0039 8.21271 0.82567 10.0226 1.17294 11.7688C1.5202 13.5149 2.37737 15.1188 3.63604 16.3777C4.89471 17.6366 6.49836 18.494 8.24419 18.8413C9.99002 19.1886 11.7996 19.0103 13.4442 18.329C15.0887 17.6477 16.4943 16.494 17.4832 15.0137C18.4722 13.5334 19 11.793 19 10.0126C19 7.62527 18.0518 5.33568 16.364 3.64755C14.6761 1.95943 12.3869 1.01105 10 1.01105ZM16.92 9.01247H14.35C14.2943 7.20945 13.8937 5.43381 13.17 3.78154C14.1678 4.28988 15.0291 5.03023 15.6817 5.94043C16.3342 6.85064 16.7588 7.90413 16.92 9.01247ZM10.45 17.0139H10H9.55C8.64 16.4438 7.55 14.2534 7.41 11.0128H12.59C12.41 14.2334 11.36 16.4238 10.45 17.0139ZM7.45 9.01247C7.63 5.7919 8.68 3.60151 9.59 3.0114H10H10.45C11.36 3.5815 12.45 5.77189 12.59 9.01247H7.45ZM6.83 3.78154C6.10626 5.43381 5.70571 7.20945 5.65 9.01247H3.08C3.24117 7.90413 3.66583 6.85064 4.31835 5.94043C4.97087 5.03023 5.83219 4.28988 6.83 3.78154ZM3.08 11.0128H5.65C5.70571 12.8158 6.10626 14.5915 6.83 16.2438C5.83219 15.7354 4.97087 14.9951 4.31835 14.0849C3.66583 13.1747 3.24117 12.1212 3.08 11.0128ZM13.17 16.2438C13.8937 14.5915 14.2943 12.8158 14.35 11.0128H16.92C16.7588 12.1212 16.3342 13.1747 15.6817 14.0849C15.0291 14.9951 14.1678 15.7354 13.17 16.2438Z" fill="#3F3B3B" stroke="white" stroke-width="0.6" stroke-linejoin="round"/>
</svg>
