<svg width="22" height="23" viewBox="0 0 22 23" fill="none" xmlns="http://www.w3.org/2000/svg">
<path fill-rule="evenodd" clip-rule="evenodd" d="M17.8531 6.14968V6.32192C20.1523 6.49416 21.9713 8.41753 21.9713 10.7846C21.9713 13.256 19.9801 15.2472 17.5087 15.2472H14.4187V13.8745H17.5087C19.2259 13.8745 20.5986 12.5018 20.5986 10.7846C20.5986 9.06736 19.2259 7.69464 17.5087 7.69464H16.2716L16.41 6.90389C16.4137 6.87332 16.4175 6.84316 16.4213 6.81339C16.451 6.57629 16.4778 6.36299 16.4778 6.14968C16.4778 3.78266 14.5571 1.85929 12.1874 1.85929C10.5042 1.85929 8.99312 2.8536 8.27283 4.36463L8.03274 4.94921L7.44816 4.74304C7.20807 4.67257 6.96797 4.60472 6.69395 4.60472C5.45694 4.60472 4.46263 5.59903 4.46263 6.83604V7.00828L4.49656 7.62679L3.87805 7.72857C2.43749 8.00259 1.37272 9.30745 1.37272 10.7846C1.37272 12.5018 2.74543 13.8745 4.46263 13.8745H7.55255V15.2498H4.46263C1.99122 15.2498 0 13.2586 0 10.7872C0 8.82987 1.27094 7.11528 3.08992 6.5307C3.26216 4.67518 4.80712 3.23462 6.69395 3.23462C6.90012 3.23462 7.10629 3.26854 7.31246 3.30247C8.30937 1.58527 10.1962 0.486572 12.19 0.486572C15.3139 0.486572 17.8531 3.02584 17.8531 6.14968ZM11.6733 11.471V19.7803L13.9386 17.5151L14.8989 18.4755L10.953 22.424L7.03843 18.0971L8.06928 17.2045L10.3006 19.6446V11.471H11.6733Z" fill="#1C67A2"/>
</svg>
