aaa_base-11.0.0-noarch-2
aaa_elflibs-11.0.0-i486-9
acl-2.2.39_1-i486-1
acpid-1.0.4-i486-2
apache-1.3.37-i486-2
apmd-3.0.2-i386-1
apr-1.2.7-i486-1
apr-util-1.2.7-i486-1
at-3.1.10-i486-1
attr-2.4.32_1-i486-1
bash-3.1.017-i486-1
bin-11.0-i486-3
bind-9.3.2_P1-i486-1
bzip2-1.0.3-i486-3
coreutils-5.97-i486-1
cxxlibs-6.0.3-i486-1
cyrus-sasl-2.1.22-i486-1
dcron-2.3.3-i486-5
devs-2.3.1-noarch-25
dhcpcd-2.0.4-i486-2
diffutils-2.8.1-i486-3
e2fsprogs-1.38-i486-2
elvis-2.2_0-i486-2
etc-11.0-noarch-2
findutils-4.2.28-i486-1
gawk-3.1.5-i486-3
genpower-1.0.5-i486-1
gettext-0.15-i486-1
gettext-tools-0.15-i486-1
glibc-i18n-2.3.6-noarch-6
glibc-solibs-2.3.6-i486-6
glibc-zoneinfo-2.3.6-noarch-6
gnupg-1.4.5-i486-1
grep-2.5-i486-3
groff-1.19.2-i486-1
gzip-1.3.5-i486-1
hdparm-6.6-i486-1
hotplug-2004_09_23-noarch-11
inetd-1.79s-i486-7
iproute2-2.6.16_060323-i486-1
iptables-1.3.5-i486-2
isapnptools-1.26-i386-1
kernel-ide-2.4.33.3-i486-1
kernel-modules-2.4.33.3-i486-1
less-394-i486-1
lftp-3.5.4-i486-1
libart_lgpl-2.3.17-i486-1
libidn-0.6.5-i486-1
libxml2-2.6.26-i486-1
lilo-22.7.1-i486-2
logrotate-3.7.4-i486-1
mailx-12.1-i486-1
man-1.6c-i486-2
man-pages-2.39-noarch-1
mhash-0.9.7-i486-1
module-init-tools-3.2.2-i486-2
mutt-1.4.2.2i-i486-1
mysql-5.0.24a-i486-1
nc-1.10-i386-1
neon-0.25.5-i486-2
openssh-4.4p1-i486-1
openssl-0.9.8d-i486-1
openssl-solibs-0.9.8d-i486-1
pciutils-2.2.3-i486-2
pcmcia-cs-3.2.8-i486-3
php-4.4.4-i486-3
pidentd-3.0.19-i486-1
pkgtools-11.0.0-i486-4
portmap-5.0-i486-3
procmail-3.22-i486-2
procps-3.2.7-i486-1
reiserfsprogs-3.6.19-i486-1
screen-4.0.2-i486-1
sed-4.1.5-i486-1
sendmail-8.13.8-i486-4
shadow-4.0.3-i486-13
sharutils-4.6.3-i486-1
slocate-3.1-i486-1
subversion-1.4.0-i486-1
sudo-1.6.8p12-i486-1
sysfsutils-2.0.0-i486-2
sysklogd-1.4.1-i486-9
syslinux-2.13-i486-1
sysvinit-2.84-i486-69
tar-1.15.1-i486-2
tcpip-0.17-i486-39
texinfo-4.8-i486-1
udev-097-i486-10
usbutils-0.72-i486-1
utempter-1.1.3-i486-1
util-linux-2.12r-i486-5
vim-7.0.109-i486-1
wget-1.10.2-i486-2
