[
  {
    "id": 1,
    "name": "Хакеры",
    "image": "images/event1.jpg",
    "description": "Продолжается... 21 октября в 18:00 мы вновь сыграем в онлайн-игру «ХАКЕРЫ». Если ты до сих пор не знаешь что это, то скорее участвуй, мы рады каждому! Чтобы попасть к нам, тебе нужно зарегистрироваться через бота в сообщениях группы 🙌Для игры понадобится веб-камера и Discord, а в день X ты получишь ссылку-приглашение 💻С нетерпением ждём тебя, чтобы провести вечер среды в хорошем настроении 🌟",
    "date": "21.10.2020 18:00",
    "organization": "Научный клуб СФУ",
    "location": "Discord",
    "review": "https://forms.gle/5m3N4ssdHQz82NFdA"
  },
  {
    "id": 2,
    "name": "Лига дебатов",
    "image": "images/event2.jpg",
    "description": "Напоминаем, что уже завтра, 23 октября, в 19:00 состоятся онлайн дебаты между ПИ и ИКИТом на тему 'Деградация интеллектуальной сферы в эпоху глобальной компьютеризации: за и против'",
    "date": "23.10.2020 19:00 ",
    "organization": "Научный клуб СФУ",
    "location": "Discord",
    "review": "https://forms.gle/5m3N4ssdHQz82NFdA"
  },
  {
    "id": 3,
    "name": "Ложь и вымысел",
    "image": "images/event3.jpg",
    "description": "16 октября состоится совершенно новое мероприятие от Научного клуба - «Ложь или вымысел»! Это студенческие дебаты, для участия в которых вам необходимо зарегистрировать команду из 2-3 человек через бота в сообщениях группы. А само мероприятие пройдёт в онлайн-формате ",
    "date": "16.10.2020",
    "organization": "Научный клуб СФУ",
    "location": "Discord",
    "review": "https://forms.gle/5m3N4ssdHQz82NFdA"
  },
  {
    "id": 4,
    "name": "Своя игра",
    "image": "images/event4.jpg",
    "description": "Сезон онлайн-игр уже открыт! И уже во второй раз мы готовы встретить тебя на нашей онлайн-площадке ",
    "date": "24.10.2020 18:00",
    "organization": "Научный клуб СФУ",
    "location": "Discord",
    "review": "https://forms.gle/5m3N4ssdHQz82NFdA"
  },
  {
    "id": 5,
    "name": "100к1",
    "image": "images/event5.jpg",
    "description": "Выходные и дистанционное обучение — не повод отменять наши планы, поэтому мы приготовили для вас кое-что особенное ",
    "date": "30.10.2020 17:00",
    "organization": "Научный клуб СФУ",
    "location": "Discord",
    "review": "https://forms.gle/5m3N4ssdHQz82NFdA"
  },
  {
    "id": 6,
    "name": "Лекция 'Войти в IT'",
    "image": "images/event6.jpg",
    "description": "Не успел на лекции в среду? Наоборот успел и все так понравилось, что не хотелось уходить? Тогда у нас для тебя хорошая новость!Мы подготовили новые лекции! Встречаемся уже в четверг в 19:00 на том же месте в Jeffrey's Coffee!",
    "date": "4.10.2020 19:00",
    "organization": "Научный клуб СФУ",
    "location": "Discord",
    "review": "https://forms.gle/5m3N4ssdHQz82NFdA"
  }
]
