#Name DistanceModulus    RA       DEC     PM_RA    PM_DEC    v_rad
Bootes_3  18.3500     209.3000    26.8    -1.16    -0.88     197.50 
Tucana_3  16.8000     359.1075 -59.58332  -0.08    -1.62    -101.20
