
                                                                     __ _
  _ __ ___  ___       ___ _ __   __ _  ___ ___        ___ _ __ __ _ / _| |_
 | '_ ` _ \/ __|_____/ __| '_ \ / _` |/ __/ _ \_____ / __| '__/ _` | |_| __|
 | | | | | \__ \_____\__ \ |_) | (_| | (_|  __/_____| (__| | | (_| |  _| |_
 |_| |_| |_|___/     |___/ .__/ \__,_|\___\___|      \___|_|  \__,_|_|  \__|
                         |_|
${AnsiColor.GREEN}:: Spring Boot :: ${spring-boot.formatted-version} ::