{
  "files": {
    "main.css": "/static/css/main.4c798faf.chunk.css",
    "main.js": "/static/js/main.df38cf0e.chunk.js",
    "main.js.map": "/static/js/main.df38cf0e.chunk.js.map",
    "runtime-main.js": "/static/js/runtime-main.3c7fdb96.js",
    "runtime-main.js.map": "/static/js/runtime-main.3c7fdb96.js.map",
    "static/js/2.857dfa27.chunk.js": "/static/js/2.857dfa27.chunk.js",
    "static/js/2.857dfa27.chunk.js.map": "/static/js/2.857dfa27.chunk.js.map",
    "index.html": "/index.html",
    "precache-manifest.3c7b659ebb0b2cfa24c64051ea05fe0b.js": "/precache-manifest.3c7b659ebb0b2cfa24c64051ea05fe0b.js",
    "service-worker.js": "/service-worker.js",
    "static/css/main.4c798faf.chunk.css.map": "/static/css/main.4c798faf.chunk.css.map",
    "static/js/2.857dfa27.chunk.js.LICENSE.txt": "/static/js/2.857dfa27.chunk.js.LICENSE.txt"
  },
  "entrypoints": [
    "static/js/runtime-main.3c7fdb96.js",
    "static/js/2.857dfa27.chunk.js",
    "static/css/main.4c798faf.chunk.css",
    "static/js/main.df38cf0e.chunk.js"
  ]
}