{
  "project_info": {
    "project_number": "917362664162",
    "firebase_url": "https://accountability-app-761af.firebaseio.com",
    "project_id": "accountability-app-761af",
    "storage_bucket": "accountability-app-761af.appspot.com"
  },
  "client": [
    {
      "client_info": {
        "mobilesdk_app_id": "1:917362664162:android:8d9934cf6cb630576834bb",
        "android_client_info": {
          "package_name": "com.arccus.accountability"
        }
      },
      "oauth_client": [
        {
          "client_id": "917362664162-qb5ha9fer9hd6lmdg2cb3ff0sk0oln4o.apps.googleusercontent.com",
          "client_type": 1,
          "android_info": {
            "package_name": "com.arccus.accountability",
            "certificate_hash": "59c7dbf2e88009226932a3415012ae1998b5f8bc"
          }
        },
        {
          "client_id": "917362664162-vjkepnidd6epc4afcd3csgh88f2bd9f2.apps.googleusercontent.com",
          "client_type": 3
        }
      ],
      "api_key": [
        {
          "current_key": "AIzaSyCU4aKvNOQpAjP66PsG58Zeh9FDsbIQ1zk"
        }
      ],
      "services": {
        "appinvite_service": {
          "other_platform_oauth_client": [
            {
              "client_id": "917362664162-vjkepnidd6epc4afcd3csgh88f2bd9f2.apps.googleusercontent.com",
              "client_type": 3
            }
          ]
        }
      }
    }
  ],
  "configuration_version": "1"
}